Diuron
- Formula: C9H10Cl2N2O
- Molecular weight: 233.095
- IUPAC Standard InChIKey: XMTQQYYKAHVGBJ-UHFFFAOYSA-N
- CAS Registry Number: 330-54-1
- Chemical structure:
View 3d structure (requires JavaScript / HTML 5) - Other names: Urea, N'-(3,4-dichlorophenyl)-N,N-dimethyl-; Urea, 3-(3,4-dichlorophenyl)-1,1-dimethyl-; Duran; DCMU; DMU; Herbatox; Karmex; Karmex Diuron Herbicide; Karmex DW; Marmer; N-(3,4-Dichlorophenyl)-N',N'-dimethylurea; N'-(3,4-Dichlorophenyl)-N,N-dimethylurea; Telvar Diuron Weed Killer; 1-(3,4-Dichlorophenyl)-3,3-dimethylurea; 1,1-Dimethyl-3-(3,4-dichlorophenyl)urea; 3-(3,4-Dichlorophenyl)-1,1-dimethylurea; Dailon; Di-On; Dichlorfenidim; Dynex; HW 920; Karamex; Vonduron; 3-(3,4-Dichloor-fenyl)-1,1-dimethylureum; 3-(3,4-Dichlor-phenyl)-1,1-dimethyl-harnstoff; 3-(3,4-Dichlorophenol)-1,1-dimethylurea; 3-(3,4-Dicloro-fenyl)-1,1-dimetil-urea; Aguron; Cekiuron; Crisuron; Diater; Direx 4L; Direx 80W; Diuron 4L; Karmex 80W; Karmex DL; Unidron; Urox D; Xarmex; DCMU 99; DP Hardener 95; Diuron Nortox; Karmex D; N,N,-Dimethyl-N'-(3,4-dichlorophenyl)urea; Lucenit; Preventol A 6

Condensed phase thermochemistry data

Data compiled by: Hussein Y. Afeefy, Joel F. Liebman, and Stephen E. Stein
Quantity | Value | Units | Method | Reference | Comment |
---|---|---|---|---|---|
ΔfH°solid | -329. ± 4.2 | kJ/mol | Ccb | Selivanov and Konstantinov, 1975 | |
Quantity | Value | Units | Method | Reference | Comment |
ΔcH°solid | -4681.9 ± 4.2 | kJ/mol | Ccb | Selivanov and Konstantinov, 1975 |

Phase change data

Data compiled as indicated in comments:
TRC - Thermodynamics Research Center, NIST Boulder Laboratories, Chris Muzny director
AC - William E. Acree, Jr., James S. Chickos
Quantity | Value | Units | Method | Reference | Comment |
---|---|---|---|---|---|
Tfus | 430.70 | K | N/A | Donnelly, Drewes, et al., 1990 | Uncertainty assigned by TRC = 0.2 K; TRC |
Tfus | 429.7 | K | N/A | Plato and Glasgow, 1969 | Uncertainty assigned by TRC = 0.2 K; TRC |
Quantity | Value | Units | Method | Reference | Comment |
ΔsubH° | 133.9 ± 0.7 | kJ/mol | C | Pfefer, Sabbah, et al., 1997 | AC |
Enthalpy of sublimation
ΔsubH (kJ/mol) | Temperature (K) | Method | Reference | Comment |
---|---|---|---|---|
119. ± 0.6 | 393. | C | Pfefer, Sabbah, et al., 1997 | AC |
Enthalpy of fusion
ΔfusH (kJ/mol) | Temperature (K) | Method | Reference | Comment |
---|---|---|---|---|
25.28 | 435.1 | DSC | Rodante, Vecchio, et al., 2000 | AC |
30.47 | 430.5 | DSC | Donnelly, Drewes, et al., 1990, 2 | AC |
33.89 | 429.7 | DSC | Plato and Glasgow, 1969, 2 | AC |

Reaction thermochemistry data

Data compiled by: Hussein Y. Afeefy, Joel F. Liebman, and Stephen E. Stein
Individual Reactions
By formula: C9H10Cl2N2O = C7H3Cl2NO + C2H7N
Quantity | Value | Units | Method | Reference | Comment |
---|---|---|---|---|---|
ΔrH° | 118.5 ± 2.3 | kJ/mol | Eqk | Chimishkyan, Svetlova, et al., 1984 | solid phase; Dissociation |

References

Selivanov and Konstantinov, 1975
Selivanov, V.D.; Konstantinov, I.I.,
Thermochemistry of chloroaryl isocyanates,
Russ. J. Phys. Chem. (Engl. Transl.), 1975, 49, 620-621. [all data]
Donnelly, Drewes, et al., 1990
Donnelly, J.R.; Drewes, L.A.; Johnson, R.L.; Munslow, W.D.; Knapp, K.K.; Sovocool, G.W.,
Purity and heat of fusion data for environmental standards as determined by differential scanning calorimetry,
Thermochim. Acta, 1990, 167, 2, 155, https://doi.org/10.1016/0040-6031(90)80476-F
. [all data]
Plato and Glasgow, 1969
Plato, C.; Glasgow, A.R., Jr.,
Differential scanning calorimetry as a general method for determining the purity and heat of fusion of high-purity organic chemicals. Application to 95 compounds,
Anal. Chem., 1969, 41, 2, 330, https://doi.org/10.1021/ac60271a041
. [all data]
Pfefer, Sabbah, et al., 1997
Pfefer, G.; Sabbah, R.; Boistelle, R.,
Half-Crystal Energy and Enthalpy of Sublimation of Diuron: 3-(3,4-Dichlorophenyl)-1,1-dimethylurea,
J Appl Cryst, 1997, 30, 5, 527-531, https://doi.org/10.1107/S0021889896014501
. [all data]
Rodante, Vecchio, et al., 2000
Rodante, F.; Vecchio, S.; Catalani, G.; Guidotti, M.,
Journal of Thermal Analysis and Calorimetry, 2000, 60, 2, 605-622, https://doi.org/10.1023/A:1010159424733
. [all data]
Donnelly, Drewes, et al., 1990, 2
Donnelly, J.R.; Drewes, L.A.; Johnson, R.L.; Munslow, W.D.; Knapp, K.K.; Sovocool, G.W.,
Purity and heat of fusion data for environmental standards as determined by differential scanning calorimetry,
Thermochimica Acta, 1990, 167, 2, 155-187, https://doi.org/10.1016/0040-6031(90)80476-F
. [all data]
Plato and Glasgow, 1969, 2
Plato, Candace.; Glasgow, Augustus R.,
Differential scanning calorimetry as a general method for determining the purity and heat of fusion of high-purity organic chemicals. Application to 95 compounds,
Anal. Chem., 1969, 41, 2, 330-336, https://doi.org/10.1021/ac60271a041
. [all data]
Chimishkyan, Svetlova, et al., 1984
Chimishkyan, A.L.; Svetlova, L.P.; Leonova, T.V.; Gluyaev, N.D.,
Thermal decomposition of substituted ureas,
J. Gen. Chem. USSR, 1984, 54, 1317-1320. [all data]