Propane, 1-(1,1-dimethylethoxy)-2-methyl-
- Formula: C8H18O
- Molecular weight: 130.2279
- IUPAC Standard InChIKey: UPOMCDPCTBJJDA-UHFFFAOYSA-N
- CAS Registry Number: 33021-02-2
- Chemical structure:
View 3d structure (requires JavaScript / HTML 5) - Other names: tert-Butyl Isobutyl ether; 1-tert-Butoxy-2-methylpropane; Isobutyl tert-butyl ether; 1-(1,1-dimethylethoxy)-2-methylpropane

Gas phase thermochemistry data

Data compiled by: Hussein Y. Afeefy, Joel F. Liebman, and Stephen E. Stein
Quantity | Value | Units | Method | Reference | Comment |
---|---|---|---|---|---|
ΔfH°gas | -368.2 ± 2.0 | kJ/mol | Ccb | Verevkin, Beckhaus, et al., 1996 | |
ΔfH°gas | -369.0 ± 1.6 | kJ/mol | Ccb | Sharonov, Mishentseva, et al., 1991 |

Condensed phase thermochemistry data

Data compiled by: Hussein Y. Afeefy, Joel F. Liebman, and Stephen E. Stein
Quantity | Value | Units | Method | Reference | Comment |
---|---|---|---|---|---|
ΔfH°liquid | -409.1 ± 2.0 | kJ/mol | Ccb | Verevkin, Beckhaus, et al., 1996 | |
ΔfH°liquid | -409.1 ± 1.6 | kJ/mol | Ccb | Sharonov, Mishentseva, et al., 1991 | |
Quantity | Value | Units | Method | Reference | Comment |
ΔcH°liquid | -5311.5 ± 2.0 | kJ/mol | Ccb | Verevkin, Beckhaus, et al., 1996 | Corresponding ΔfHºliquid = -409.1 kJ/mol (simple calculation by NIST; no Washburn corrections) |
ΔcH°liquid | -5311.5 ± 1.2 | kJ/mol | Ccb | Sharonov, Mishentseva, et al., 1991 | Corresponding ΔfHºliquid = -409.1 kJ/mol (simple calculation by NIST; no Washburn corrections) |

Phase change data

Data compiled as indicated in comments:
AC - William E. Acree, Jr., James S. Chickos
ALS - Hussein Y. Afeefy, Joel F. Liebman, and Stephen E. Stein
Quantity | Value | Units | Method | Reference | Comment |
---|---|---|---|---|---|
Tboil | 385.2 | K | N/A | Majer and Svoboda, 1985 | |
Quantity | Value | Units | Method | Reference | Comment |
ΔvapH° | 40. ± 2. | kJ/mol | AVG | N/A | Average of 8 values; Individual data points |
Enthalpy of vaporization
ΔvapH (kJ/mol) | Temperature (K) | Reference | Comment |
---|---|---|---|
33.11 | 385.2 | Majer and Svoboda, 1985 |
Enthalpy of fusion
ΔfusH (kJ/mol) | Temperature (K) | Reference | Comment |
---|---|---|---|
8.65 | 162.3 | Druzhinina, Dorofeeva, et al., 2006 | AC |

Reaction thermochemistry data

Data compiled by: Hussein Y. Afeefy, Joel F. Liebman, and Stephen E. Stein
Individual Reactions
By formula: C4H8 + C4H10O = C8H18O
Quantity | Value | Units | Method | Reference | Comment |
---|---|---|---|---|---|
ΔrH° | -36.3 ± 1.8 | kJ/mol | Eqk | Sharonov, Mishentseva, et al., 1991, 2 | liquid phase |

Kovats' RI, non-polar column, isothermal

Column type | Active phase | Temperature (C) | I | Reference | Comment |
---|---|---|---|---|---|
Capillary | Methyl Silicone | 100. | 750.2 | Boneva and Toromanova-Petrova, 1994 | Column length: 50. m; Column diameter: 0.25 mm |
Capillary | Methyl Silicone | 90. | 748.8 | Boneva and Toromanova-Petrova, 1994 | Column length: 50. m; Column diameter: 0.25 mm |

Normal alkane RI, non-polar column, isothermal

Column type | Active phase | Temperature (C) | I | Reference | Comment |
---|---|---|---|---|---|
Capillary | DB-5 | 60. | 763. | Verevkin, Krasnykh, et al., 2003 | 60. m/0.32 mm/0.25 μm, Nitrogen |

References

Verevkin, Beckhaus, et al., 1996
Verevkin, S.P.; Beckhaus, H.-D.; Belen'kaja, R.S.; Rakus, K.; Ruchardt, C.,
Geminal substituent effects Part 9. Standard enthalpies of formation and strain free increments of branched esters and ethers,
Thermochim. Acta, 1996, 279, 47-64. [all data]
Sharonov, Mishentseva, et al., 1991
Sharonov, K.G.; Mishentseva, Y.B.; Rozhnov, A.M.; Miroshnichenko, E.A.; Korchatova, L.I.,
Molar enthalpies of formation and vaporization of t-butoxybutanes and thermodynamics of their synthesis from a butanol and 2-methylpropene 2. Enthalpies of combustion and vaporization of t-butoxybutanes,
J. Chem. Thermodyn., 1991, 23, 637-642. [all data]
Majer and Svoboda, 1985
Majer, V.; Svoboda, V.,
Enthalpies of Vaporization of Organic Compounds: A Critical Review and Data Compilation, Blackwell Scientific Publications, Oxford, 1985, 300. [all data]
Druzhinina, Dorofeeva, et al., 2006
Druzhinina, A.I.; Dorofeeva, O.V.; Varushchenko, R.M.; Krasnykh, E.L.,
The low-temperature heat capacity and ideal gas thermodynamic properties of isobutyl tert-butyl ether,
The Journal of Chemical Thermodynamics, 2006, 38, 1, 10-19, https://doi.org/10.1016/j.jct.2005.02.003
. [all data]
Sharonov, Mishentseva, et al., 1991, 2
Sharonov, K.G.; Mishentseva, Y.B.; Rozhnov, A.M.; Miroshnichenko, E.A.; Korchatova, L.I.,
Molar enthalpies of formation and vaporizqation of t-butoxybutanes and thermodynamics of their synthesis from a butanol and 2-methylpropene I. Equilibria of synthesis reactions of t-butoxybutanes in the liquid phase,
J. Chem. Thermodyn., 1991, 23, 141-145. [all data]
Boneva and Toromanova-Petrova, 1994
Boneva, S.; Toromanova-Petrova, P.,
Capillary gas chromatography of C1-C4 alkyl tert-butyl ethers,
Chromatographia, 1994, 39, 3/4, 224-227, https://doi.org/10.1007/BF02274504
. [all data]
Verevkin, Krasnykh, et al., 2003
Verevkin, Sergey P.; Krasnykh, Eugen L.; Vasiltsova, Tatiana V.; Heintz, Andreas,
Determination of Ambient Temperature Vapor Pressures and Vaporization Enthalpies of Branched Ethers,
J. Chem. Eng. Data, 2003, 48, 3, 591-599, https://doi.org/10.1021/je0255980
. [all data]