Hexanoic acid, 3,5,5-trimethyl-
- Formula: C9H18O2
- Molecular weight: 158.2380
- IUPAC Standard InChIKey: OILUAKBAMVLXGF-UHFFFAOYSA-N
- CAS Registry Number: 3302-10-1
- Chemical structure:
View 3d structure (requires JavaScript / HTML 5) - Other names: 3,5,5-Trimethylhexanoic acid

Van Den Dool and Kratz RI, non-polar column, custom temperature program

Column type | Active phase | I | Reference | Comment |
---|---|---|---|---|
Capillary | VF-5MS | 1139. | Tretyakov, 2011 | 30. m/0.25 mm/0.25 μm, He; Program: Multi-step temperature program; T(initial)=60C; T(final)=270C |

References

Tretyakov, 2011
Tretyakov, K.V.,
Retention Data. NIST Mass Spectrometry Data Center., NIST Mass Spectrometry Data Center, 2011. [all data]