δ-Nonalactone
- Formula: C9H16O2
- Molecular weight: 156.2221
- IUPAC Standard InChIKey: PXRBWNLUQYZAAX-UHFFFAOYSA-N
- CAS Registry Number: 3301-94-8
- Chemical structure:

Phase change data

Data compiled by: William E. Acree, Jr., James S. Chickos
Quantity | Value | Units | Method | Reference | Comment |
---|---|---|---|---|---|
ΔvapH° | 16.9 ± 0.1 | kcal/mol | GS | Emel'yanenko, Kozlova, et al., 2007 | Based on data from 293. to 348. K. |

Van Den Dool and Kratz RI, non-polar column, temperature ramp

View large format table.

Column type Active phase I Reference Comment
CapillaryBPX-51404.Dickschat J.S., Wagner-Dobler I., et al., 200525. m/0.25 mm/0.25 μm, He, 50. C @ 5. min, 5. K/min; Tend: 300. C

Van Den Dool and Kratz RI, polar column, temperature ramp

View large format table.

Column type Active phase I Reference Comment
CapillaryDB-FFAP2023.Avsar, Karagul-Yuceer, et al., 200415. m/0.32 mm/0.25 μm, He, 35. C @ 5. min, 10. K/min, 225. C @ 15. min

Normal alkane RI, non-polar column, custom temperature program

View large format table.

Column type Active phase I Reference Comment
CapillarySE-301356.Vinogradov, 2004Program: not specified

Normal alkane RI, polar column, custom temperature program

View large format table.

Column type Active phase I Reference Comment
CapillaryCarbowax 20M2038.Vinogradov, 2004Program: not specified

References

Emel'yanenko, Kozlova, et al., 2007
Emel'yanenko, Vladimir N.; Kozlova, Svetlana A.; Verevkin, Sergey P.; Roganov, Gennady N.,
Vapour pressures and enthalpies of vaporization of a series of δ-lactones,
The Journal of Chemical Thermodynamics, 2007, 39, 1, 10-15, https://doi.org/10.1016/j.jct.2006.06.010
. [all data]