2-Butanone, 4-(diethylamino)-
- Formula: C8H17NO
- Molecular weight: 143.2267
- IUPAC Standard InChIKey: XLEOCTUCGZANAC-UHFFFAOYSA-N
- CAS Registry Number: 3299-38-5
- Chemical structure:
View 3d structure (requires JavaScript / HTML 5) - Other names: 1-(Diethylamino)-3-butanone; 4-(Diethylamino)-2-butanone; 4-(N,N-Diethylamino)butan-2-one; 4-(diethylamino)butan-2-one

Phase change data

Data compiled by: Robert L. Brown and Stephen E. Stein
Reduced pressure boiling point
Tboil (K) | Pressure (bar) | Reference |
---|---|---|
350.2 | 0.021 | Aldrich Chemical Company Inc., 1990 |

Normal alkane RI, non-polar column, custom temperature program

Column type | Active phase | I | Reference | Comment |
---|---|---|---|---|
Capillary | Methyl Silicone | 1025. | Zenkevich, 1999 | Program: not specified |
Capillary | Polydimethyl siloxanes | 1025. | Zenkevich, 1997 | Program: not specified |
Capillary | Polydimethyl siloxanes | 1025. | Zenkevich and Chupalov, 1996 | Program: not specified |

References

Aldrich Chemical Company Inc., 1990
Aldrich Chemical Company Inc.,
Catalog Handbook of Fine Chemicals, Aldrich Chemical Company, Inc., Milwaukee WI, 1990, 1. [all data]
Halpern and Lyons, 1976
Halpern, A.M.; Lyons, A.L., Jr.,
J. Am. Chem. Soc., 1976, 98, 3242. [all data]
Zenkevich, 1999
Zenkevich, I.G.,
New Application of the Retention Index Concept in Gas and High Performance Liquid Chromatography,
Fresenius' J. Anal. Chem., 1999, 365, 4, 305-309, https://doi.org/10.1007/s002160051491
. [all data]
Zenkevich, 1997
Zenkevich, I.G.,
Influence of the Variations of Dynamics Molecular Parameterts on the Additivity of Chromatigraphic Retention Indices of Products of Organic Reactions Relative to Initial Reagents,
Dokl. Akad. Nauk (Rus.), 1997, 353, 5, 625-627. [all data]
Zenkevich and Chupalov, 1996
Zenkevich, I.G.; Chupalov, A.A.,
New Possibilities of Chromato Mass Pectrometric Identification of Organic Compounds Using Increments of Gas Chromatographic Retention Indices of Molecular Structural Fragments,
Zh. Org. Khim. (Rus.), 1996, 32, 5, 656-666. [all data]