2-(tert-butoxy)butane
- Formula: C8H18O
- Molecular weight: 130.2279
- IUPAC Standard InChIKey: WMZNUJPPIPVIOD-UHFFFAOYSA-N
- CAS Registry Number: 32970-45-9
- Chemical structure:
View 3d structure (requires JavaScript / HTML 5) - Species with the same structure:
- Other names: Butane, 2-(1,1-dimethylethoxy)-

Gas phase thermochemistry data

Data compiled by: Hussein Y. Afeefy, Joel F. Liebman, and Stephen E. Stein
Quantity | Value | Units | Method | Reference | Comment |
---|---|---|---|---|---|
ΔfH°gas | -380.0 ± 1.8 | kJ/mol | Ccb | Sharonov, Mishentseva, et al., 1991 |

Condensed phase thermochemistry data

Data compiled by: Hussein Y. Afeefy, Joel F. Liebman, and Stephen E. Stein
Quantity | Value | Units | Method | Reference | Comment |
---|---|---|---|---|---|
ΔfH°liquid | -420.3 ± 1.8 | kJ/mol | Ccb | Sharonov, Mishentseva, et al., 1991 | |
Quantity | Value | Units | Method | Reference | Comment |
ΔcH°liquid | -5300.3 ± 1.4 | kJ/mol | Ccb | Sharonov, Mishentseva, et al., 1991 | Corresponding ΔfHºliquid = -420.3 kJ/mol (simple calculation by NIST; no Washburn corrections) |

Phase change data

Data compiled as indicated in comments:
AC - William E. Acree, Jr., James S. Chickos
ALS - Hussein Y. Afeefy, Joel F. Liebman, and Stephen E. Stein
Quantity | Value | Units | Method | Reference | Comment |
---|---|---|---|---|---|
ΔvapH° | 41.3 | kJ/mol | N/A | Verevkin, 2002 | See also Verevkin, Krasnykh, et al., 2003.; AC |
ΔvapH° | 40.3 ± 0.2 | kJ/mol | C | Sharonov, Mishentseva, et al., 1991, 2 | AC |
ΔvapH° | 40.34 ± 0.18 | kJ/mol | C | Sharonov, Mishentseva, et al., 1991 | ALS |

Reaction thermochemistry data

Data compiled by: Hussein Y. Afeefy, Joel F. Liebman, and Stephen E. Stein
Individual Reactions
By formula: C4H8 + C4H10O = C8H18O
Quantity | Value | Units | Method | Reference | Comment |
---|---|---|---|---|---|
ΔrH° | -37.7 ± 2.4 | kJ/mol | Eqk | Sharonov, Mishentseva, et al., 1991, 3 | liquid phase |

References

Sharonov, Mishentseva, et al., 1991
Sharonov, K.G.; Mishentseva, Y.B.; Rozhnov, A.M.; Miroshnichenko, E.A.; Korchatova, L.I.,
Molar enthalpies of formation and vaporization of t-butoxybutanes and thermodynamics of their synthesis from a butanol and 2-methylpropene 2. Enthalpies of combustion and vaporization of t-butoxybutanes,
J. Chem. Thermodyn., 1991, 23, 637-642. [all data]
Verevkin, 2002
Verevkin, Sergey P.,
Improved Benson Increments for the Estimation of Standard Enthalpies of Formation and Enthalpies of Vaporization of Alkyl Ethers, Acetals, Ketals, and Ortho Esters,
J. Chem. Eng. Data, 2002, 47, 5, 1071-1097, https://doi.org/10.1021/je020023o
. [all data]
Verevkin, Krasnykh, et al., 2003
Verevkin, Sergey P.; Krasnykh, Eugen L.; Vasiltsova, Tatiana V.; Heintz, Andreas,
Determination of Ambient Temperature Vapor Pressures and Vaporization Enthalpies of Branched Ethers,
J. Chem. Eng. Data, 2003, 48, 3, 591-599, https://doi.org/10.1021/je0255980
. [all data]
Sharonov, Mishentseva, et al., 1991, 2
Sharonov, K.G.; Mishentseva, Y.B.; Rozhnov, A.M.; Miroshnichenko, E.A.; Korchatova, L.I.,
Molar enthalpies of formation and vaporization of t-butoxybutanes and thermodynamics of their synthesis from a butanol and 2-methylpropene,
The Journal of Chemical Thermodynamics, 1991, 23, 7, 636-642, https://doi.org/10.1016/S0021-9614(05)80200-9
. [all data]
Sharonov, Mishentseva, et al., 1991, 3
Sharonov, K.G.; Mishentseva, Y.B.; Rozhnov, A.M.; Miroshnichenko, E.A.; Korchatova, L.I.,
Molar enthalpies of formation and vaporizqation of t-butoxybutanes and thermodynamics of their synthesis from a butanol and 2-methylpropene I. Equilibria of synthesis reactions of t-butoxybutanes in the liquid phase,
J. Chem. Thermodyn., 1991, 23, 141-145. [all data]