1-Cyclohexene-1-propanol, α,2,6,6-tetramethyl-

Van Den Dool and Kratz RI, non-polar column, custom temperature program

View large format table.

Column type Active phase I Reference Comment
CapillaryHP-5MS1449.2Andriamaharavo, 201430. m/0.25 mm/0.25 μm, He; Program: 60C (1 min) => 5 C/min => 210C => 10 C/min => 280C (15 min)

Van Den Dool and Kratz RI, polar column, temperature ramp

View large format table.

Column type Active phase I Reference Comment
CapillaryHP-20M1907.Maric, Jukic, et al., 200750. m/0.2 mm/0.2 μm, He, 70. C @ 4. min, 4. K/min, 180. C @ 15. min
CapillarySupelcowax-101966.Riu-Aumatell, Lopez-Tamames, et al., 200530. m/0.25 mm/0.25 μm, He, 60. C @ 5. min, 3. K/min, 240. C @ 10. min

Van Den Dool and Kratz RI, polar column, custom temperature program

View large format table.

Column type Active phase I Reference Comment
CapillaryStabilwax1991.Klesk, Qian, et al., 200430. m/0.32 mm/1. μm, He; Program: 40C (2min) => 5C/min => 100C => 4C/min => 230C (10min)

Normal alkane RI, non-polar column, temperature ramp

View large format table.

Column type Active phase I Reference Comment
CapillaryDB-51455.Rout, Naik, et al., 200630. m/0.25 mm/0.25 μm, He, 2. K/min, 200. C @ 60. min; Tstart: 60. C

Normal alkane RI, polar column, temperature ramp

View large format table.

Column type Active phase I Reference Comment
CapillaryInnowax1976.Joichi, Yomogida, et al., 200560. m/0.25 mm/0.25 μm, He, 5. K/min, 240. C @ 30. min; Tstart: 60. C
CapillaryDB-Wax1971.Werkhoff, Güntert, et al., 199860. m/0.32 mm/0.25 μm, H2, 3. K/min; Tstart: 60. C; Tend: 220. C
CapillaryCarbowax 20M1926.Mihara, Tateba, et al., 1988N2, 3. K/min; Column length: 50. m; Column diameter: 0.22 mm; Tstart: 80. C; Tend: 200. C
CapillaryCarbowax 20M1936.Mihara, Tateba, et al., 1988N2, 3. K/min; Column length: 50. m; Column diameter: 0.22 mm; Tstart: 80. C; Tend: 200. C
CapillaryCarbowax 20M1915.Mihara, Tateba, et al., 1987N2, 3. K/min; Column length: 50. m; Column diameter: 0.22 mm; Tstart: 80. C; Tend: 200. C
CapillaryCarbowax 20M1926.Mihara, Tateba, et al., 1987N2, 3. K/min; Column length: 50. m; Column diameter: 0.22 mm; Tstart: 80. C; Tend: 200. C

Normal alkane RI, polar column, custom temperature program

View large format table.

Column type Active phase I Reference Comment
CapillaryInnowax FSC1977.Bardakci, Demirci, et al., 201260. m/0.25 mm/0.25 μm, Helium; Program: 60 0C (10 min) 4 0C/min -> 220 0C 1 0C/min -> 240 0C

References

Andriamaharavo, 2014
Andriamaharavo, N.R., Retention Data. NIST Mass Spectrometry Data Center., NIST Mass Spectrometry Data Center, 2014. [all data]

Maric, Jukic, et al., 2007
Maric, S.; Jukic, M.; Katalinic, V.; Milos, M., Comparison of chemical composition and free radical scavenging ability of glycosidically bound and free volatiles from Bosnian pine (Pinus heldreichii Christ. var. leucodermis), Molecules, 2007, 12, 3, 283-289, https://doi.org/10.3390/12030283 . [all data]

Riu-Aumatell, Lopez-Tamames, et al., 2005
Riu-Aumatell, M.; Lopez-Tamames, E.; Buxaderas, S., Assessment of the Volatile Composition of Juices of Apricot, Peach, and Pear According to Two Pectolytic Treatments, J. Agric. Food Chem., 2005, 53, 20, 7837-7843, https://doi.org/10.1021/jf051397z . [all data]

Klesk, Qian, et al., 2004
Klesk, K.; Qian, M.; Martin, R.R., Aroma extract dilution analysis of cv. meeker (Rubus idaeus L.) red raspberries from Oregon and Washington, J. Agric. Food Chem., 2004, 52, 16, 5155-5161, https://doi.org/10.1021/jf0498721 . [all data]

Rout, Naik, et al., 2006
Rout, P.K.; Naik, S.N.; Rao, Y.R., Composition of the concrete, absolute, headspace and essential oil of the flowers of Michelia champaca Linn., Flavour Fragr. J., 2006, 21, 6, 906-911, https://doi.org/10.1002/ffj.1742 . [all data]

Joichi, Yomogida, et al., 2005
Joichi, A.; Yomogida, K.; Awano, K.; Ueda, Y., Volatile components of tea-scented modern roses and ancient Chinese roses, Flavour Fragr. J., 2005, 20, 2, 152-157, https://doi.org/10.1002/ffj.1388 . [all data]

Werkhoff, Güntert, et al., 1998
Werkhoff, P.; Güntert, M.; Krammer, G.; Sommer, H.; Kaulen, J., Vacuum headspace method in aroma research: flavor chemistry of yellow passion fruits, J. Agric. Food Chem., 1998, 46, 3, 1076-1093, https://doi.org/10.1021/jf970655s . [all data]

Mihara, Tateba, et al., 1988
Mihara, S.; Tateba, H.; Nishimura, O.; Machii, Y.; Kishino, K., The volatile components of Chinese quince (Pseudocydonia sinensis Schneid) in Flavors and Fragrances: A World Perspective. Proceedings of the 10th International Congress of Essential Oils, Fragrances and Flavors, Lawrence,B.M.; Mookherjee,B.D.; Willis,B.J., ed(s)., Elsevier, New York, 1988, 537-550. [all data]

Mihara, Tateba, et al., 1987
Mihara, S.; Tateba, H.; Nishimura, O.; Machii, Y.; Kishino, K., Volatile components of Chinese quince (Pseudocydonia sinensis Schneid), J. Agric. Food Chem., 1987, 35, 4, 532-537, https://doi.org/10.1021/jf00076a023 . [all data]

Bardakci, Demirci, et al., 2012
Bardakci, H.; Demirci, B.; Yesilada, E.; Kirmizibekmez, H.; Naser, K.H.C., Chemical composition of the essential oil of the subterranean parts of Valeriana alliariifolia, Rec. Nat. Prod., 2012, 6, 1, 89-92. [all data]