CAS Reg. No. 329230-30-0
- CAS Registry Number: 329230-30-0

Reaction thermochemistry data

Data compiled by: John E. Bartmess
Individual Reactions
(CAS Reg. No. 329230-30-0 • 4294967295) +
= CAS Reg. No. 329230-30-0
By formula: (CAS Reg. No. 329230-30-0 • 4294967295P) + P = CAS Reg. No. 329230-30-0
Quantity | Value | Units | Method | Reference | Comment |
---|---|---|---|---|---|
ΔrH° | 354. ± 21. | kJ/mol | N/A | Jones, Ganteför, et al., 1995 | gas phase; Vertical Detachment Energy: 1.68±0.05 eV |

References

Jones, Ganteför, et al., 1995
Jones, R.O.; Ganteför, G.; Hunsicker, S.; Pieperhoff, P.,
Structure and Spectroscopy of Phosphorous Cluster anions: Theory (simulated annealing) and Experiment (Photoelectron Detachment),
J. Chem. Phys., 1995, 103, 22, 9549, https://doi.org/10.1063/1.469969
. [all data]