4-(Trifluoromethyl)benzoyl chloride
- Formula: C8H4ClF3O
- Molecular weight: 208.565
- IUPAC Standard InChIKey: OXZYBOLWRXENKT-UHFFFAOYSA-N
- CAS Registry Number: 329-15-7
- Chemical structure:
View 3d structure (requires JavaScript / HTML 5) - Other names: p-Trifluoromethylbenzoyl chloride; Benzoyl chloride, 4-(trifluoromethyl)-; α,α,α-Trifluoro-p-toluoyl chloride; p-Toluoyl chloride, α,α,α-trifluoro-; p-Trifluoromethyl benzoic acid chloride

Phase change data

Data compiled by: Robert L. Brown and Stephen E. Stein
Reduced pressure boiling point
Tboil (K) | Pressure (bar) | Reference |
---|---|---|
351. to 352. | 0.021 | Farchan Laboratories, 1990 |
351. to 352. | 0.021 | PCR Inc., 1990 |

References

Farchan Laboratories, 1990
Farchan Laboratories,
Research Chemicals Catalog, Farchan Laboratories, Gainesville, FL, 1990, 91. [all data]
PCR Inc., 1990
PCR Inc.,
Research Chemicals Catalog 1990-1991, PCR Inc., Gainesville, FL, 1990, 1. [all data]