Benzene, 1-isocyanato-3-(trifluoromethyl)-
- Formula: C8H4F3NO
- Molecular weight: 187.1187
- IUPAC Standard InChIKey: SXJYSIBLFGQAND-UHFFFAOYSA-N
- CAS Registry Number: 329-01-1
- Chemical structure:
View 3d structure (requires JavaScript / HTML 5) - Other names: Isocyanic acid, α,α,α-trifluoro-m-tolyl ester; m-(Trifluoromethyl)phenyl isocyanate; 3-(Trifluoromethyl)phenyl isocyanate; α,α,α-Trifluoro-m-tolyl isocyanate; α,α,α-Trifluoro-3-tolyl isocyanate; α,α,α-Trifluoro-meta-tolylisocyanate; Isocyanic acid m-trifluoromethylphenyl ester

Phase change data

Data compiled by: Robert L. Brown and Stephen E. Stein
Reduced pressure boiling point
Tboil (K) | Pressure (bar) | Reference |
---|---|---|
327. | 0.015 | PCR Inc., 1990 |

Reaction thermochemistry data

Data compiled by: Hussein Y. Afeefy, Joel F. Liebman, and Stephen E. Stein
Individual Reactions
By formula: C10H11F3N2O = C2H7N + C8H4F3NO
Quantity | Value | Units | Method | Reference | Comment |
---|---|---|---|---|---|
ΔrH° | 152.1 ± 2.8 | kJ/mol | Eqk | Chimishkyan, Svetlova, et al., 1984 | solid phase; Dissociation |
By formula: C15H10F6N2O = C8H4F3NO + C7H6F3N
Quantity | Value | Units | Method | Reference | Comment |
---|---|---|---|---|---|
ΔrH° | 195.2 ± 6.1 | kJ/mol | Eqk | Chimishkyan, Svetlova, et al., 1984 | solid phase; Dissociation |

References

PCR Inc., 1990
PCR Inc.,
Research Chemicals Catalog 1990-1991, PCR Inc., Gainesville, FL, 1990, 1. [all data]
Chimishkyan, Svetlova, et al., 1984
Chimishkyan, A.L.; Svetlova, L.P.; Leonova, T.V.; Gluyaev, N.D.,
Thermal decomposition of substituted ureas,
J. Gen. Chem. USSR, 1984, 54, 1317-1320. [all data]