Methyl acetylcyanoacetate
- Formula: C6H7NO3
- Molecular weight: 141.1247
- IUPAC Standard InChIKey: RJEUAEFRQVZQJY-UHFFFAOYSA-N
- CAS Registry Number: 3288-52-6
- Chemical structure:
View 3d structure (requires JavaScript / HTML 5) - Permanent link for this species. Use this link for bookmarking this species for future reference.

Condensed phase thermochemistry data

Data compiled by: Hussein Y. Afeefy, Joel F. Liebman, and Stephen E. Stein
Quantity | Value | Units | Method | Reference | Comment |
---|---|---|---|---|---|
ΔfH°solid | -489.9 | kJ/mol | Ccb | Guinchant, 1918 | Author hf288_condensed[kcal/mol]=-122.0 kcal/mol |
Quantity | Value | Units | Method | Reference | Comment |
ΔcH°solid | -2871. | kJ/mol | Ccb | Guinchant, 1918 | Author hf288_condensed[kcal/mol]=-122.0 kcal/mol |

References

Guinchant, 1918
Guinchant, M.J.,
Etude sur la fonction acide dans les derives metheniques et methiniques,
Ann. Chem., 1918, 10, 30-84. [all data]