DL-Leucine
- Formula: C6H13NO2
- Molecular weight: 131.1729
- IUPAC Standard InChIKey: ROHFNLRQFUQHCH-UHFFFAOYSA-N
- CAS Registry Number: 328-39-2
- Chemical structure:
View 3d structure (requires JavaScript / HTML 5) - Species with the same structure:
- Stereoisomers:
- Other names: Leucine, DL-; (.+/-.)-Leucine; (±)-Leucine; (.+-.)-Leucine

Reaction thermochemistry data

Data compiled by: Robert C. Dunbar
Individual Reactions
By formula: Na+ + C6H13NO2 = (Na+ • C6H13NO2)
Quantity | Value | Units | Method | Reference | Comment |
---|---|---|---|---|---|
ΔrH° | 41.8 | kcal/mol | CIDC | Kish, Ohanessian, et al., 2003 | Anchor alanine=39.89 |

Ion clustering data

Data compiled by: Robert C. Dunbar
Clustering reactions
By formula: Na+ + C6H13NO2 = (Na+ • C6H13NO2)
Quantity | Value | Units | Method | Reference | Comment |
---|---|---|---|---|---|
ΔrH° | 41.8 | kcal/mol | CIDC | Kish, Ohanessian, et al., 2003 | Anchor alanine=39.89 |

References

Kish, Ohanessian, et al., 2003
Kish, M.M.; Ohanessian, G.; Wesdemiotis, C.,
The Na+ affinities of a-amino acids: side-chain substituent effects,
Int. J. Mass Spectrom., 2003, 227, 3, 509, https://doi.org/10.1016/S1387-3806(03)00082-4
. [all data]