Pivalyl chloride
- Formula: C5H9ClO
- Molecular weight: 120.577
- IUPAC Standard InChIKey: JVSFQJZRHXAUGT-UHFFFAOYSA-N
- CAS Registry Number: 3282-30-2
- Chemical structure:
View 3d structure (requires JavaScript / HTML 5) - Other names: Propanoyl chloride, 2,2-dimethyl-; Neopentanoyl chloride; Pivalic acid chloride; Pivalolyl chloride; Pivaloyl chloride; Trimethylacetyl chloride; 2,2-Dimethylpropanoyl chloride; 2,2-Dimethylpropionyl chloride; Acetyl chloride, trimethyl-; UN 2438; 2,2,2-Trimethylacetyl chloride

Phase change data

Data compiled as indicated in comments:
BS - Robert L. Brown and Stephen E. Stein
TRC - Thermodynamics Research Center, NIST Boulder Laboratories, Chris Muzny director
Quantity | Value | Units | Method | Reference | Comment |
---|---|---|---|---|---|
Tboil | 378.7 | K | N/A | Aldrich Chemical Company Inc., 1990 | BS |
Tboil | 375. to 377. | K | N/A | Frinton Laboratories Inc., 1986 | BS |
Tboil | 376. | K | N/A | Yamase, 1961 | Uncertainty assigned by TRC = 3. K; TRC |
Tboil | 377. | K | N/A | Gaylord and Eirich, 1952 | Uncertainty assigned by TRC = 2. K; TRC |

References

Aldrich Chemical Company Inc., 1990
Aldrich Chemical Company Inc.,
Catalog Handbook of Fine Chemicals, Aldrich Chemical Company, Inc., Milwaukee WI, 1990, 1. [all data]
Frinton Laboratories Inc., 1986
Frinton Laboratories Inc.,
Catalog Number 11, Frinton Laboratories Inc., Vineland, NJ, 1986, 99. [all data]
Yamase, 1961
Yamase, Y.,
Friedel-Crafts Acylation II. Relative Reactivity for Some Acyl Halides,
Bull. Chem. Soc. Jpn., 1961, 34, 480-84. [all data]
Gaylord and Eirich, 1952
Gaylord, N.G.; Eirich, F.R.,
Allyl Polymerization. II. Decomposition of Bwenoyl Peroxide in Allyl Esters,
J. Am. Chem. Soc., 1952, 74, 334-7. [all data]