Heptanoic acid, 2-ethyl-
- Formula: C9H18O2
- Molecular weight: 158.2380
- IUPAC Standard InChIKey: DYWSVUBJGFTOQC-UHFFFAOYSA-N
- CAS Registry Number: 3274-29-1
- Chemical structure:
View 3d structure (requires JavaScript / HTML 5) - Other names: 2-Ethylheptanoic acid; 3-Octanecarboxylic acid

Phase change data

Data compiled by: William E. Acree, Jr., James S. Chickos
Enthalpy of vaporization
ΔvapH (kJ/mol) | Temperature (K) | Method | Reference | Comment |
---|---|---|---|---|
63.4 | 401. | A,EB | Stephenson and Malanowski, 1987 | Based on data from 386. to 475. K. See also Trent, Miller, et al., 1960. |

Reaction thermochemistry data

Data compiled by: John E. Bartmess
Individual Reactions
C8H17O2- + =
By formula: C8H17O2- + H+ = C9H18O2
Quantity | Value | Units | Method | Reference | Comment |
---|---|---|---|---|---|
ΔrH° | 1416. ± 8.4 | kJ/mol | TDEq | Norrman and McMahon, 1999 | gas phase; folded form. dSacid = 11.2 eu |
ΔrH° | 1446. ± 8.4 | kJ/mol | TDEq | Norrman and McMahon, 1999 | gas phase; Unfolded form |
Quantity | Value | Units | Method | Reference | Comment |
ΔrG° | 1402. ± 8.8 | kJ/mol | H-TS | Norrman and McMahon, 1999 | gas phase; folded form. dSacid = 11.2 eu |
ΔrG° | 1412. ± 8.8 | kJ/mol | H-TS | Norrman and McMahon, 1999 | gas phase; Unfolded form |

Gas phase ion energetics data

Data compiled by: John E. Bartmess

De-protonation reactions

C8H17O2- + Hydrogen cation = Heptanoic acid, 2-ethyl-

By formula: C8H17O2- + H+ = C9H18O2

Quantity Value Units Method Reference Comment
Δr1416. ± 8.4kJ/molTDEqNorrman and McMahon, 1999gas phase; folded form. dSacid = 11.2 eu
Δr1446. ± 8.4kJ/molTDEqNorrman and McMahon, 1999gas phase; Unfolded form
Quantity Value Units Method Reference Comment
Δr1402. ± 8.8kJ/molH-TSNorrman and McMahon, 1999gas phase; folded form. dSacid = 11.2 eu
Δr1412. ± 8.8kJ/molH-TSNorrman and McMahon, 1999gas phase; Unfolded form

References

Stephenson and Malanowski, 1987
Stephenson, Richard M.; Malanowski, Stanislaw,
Handbook of the Thermodynamics of Organic Compounds, 1987, https://doi.org/10.1007/978-94-009-3173-2
. [all data]
Trent, Miller, et al., 1960
Trent, F.M.; Miller, F.D.; Brown, G.H.,
Some Physical Properties of Certain C 9 and C 10 Aliphatic Acids and their Methyl Esters.2-Ethylheptanoic and Pelargonic Acids, and Methyl Esters of 2-Ethylpentanoic,Pelargonic, 2, 5-Diethyladipic, 2-Ethylsuberic, and Sebacic Acids.,
J. Chem. Eng. Data, 1960, 5, 1, 110-111, https://doi.org/10.1021/je60005a026
. [all data]
Norrman and McMahon, 1999
Norrman, K.; McMahon, T.B.,
Intramolecular solvation of carboxylate anions in the gas phase,
J. Phys. Chem. A, 1999, 103, 35, 7008-7016, https://doi.org/10.1021/jp9908202
. [all data]