2',3,3',4,4',5,6-Heptabromodiphenyl ether
- Formula: C12H3Br7O
- Molecular weight: 722.480
- IUPAC Standard InChIKey: DLPNCMQTNWLTHD-UHFFFAOYSA-N
- CAS Registry Number: 327185-13-7
- Chemical structure:
View 3d structure (requires JavaScript / HTML 5) - Permanent link for this species. Use this link for bookmarking this species for future reference.

Phase change data

Data compiled by: William E. Acree, Jr., James S. Chickos
Enthalpy of vaporization
ΔvapH (kJ/mol) | Temperature (K) | Method | Reference | Comment |
---|---|---|---|---|
121.2 | 403. to 475. | CGC | Tittlemier and Tomy, 2001 | |
115.8 | 418. | GC | Wong, Lei, et al., 2001 | Based on data from 363. to 473. K. |

References

Tittlemier and Tomy, 2001
Tittlemier, Sheryl A.; Tomy, Gregg T.,
Vapor pressures of six brominated diphenyl ether congeners,
Environ Toxicol Chem, 2001, 20, 1, 146-148, https://doi.org/10.1002/etc.5620200116
. [all data]
Wong, Lei, et al., 2001
Wong, Alexander; Lei, Ying Duan; Alaee, Mehran; Wania, Frank,
Vapor Pressures of the Polybrominated Diphenyl Ethers,
J. Chem. Eng. Data, 2001, 46, 2, 239-242, https://doi.org/10.1021/je0002181
. [all data]