Methyl, 1,2-phenylenebis-
- Formula: C8H8
- Molecular weight: 104.1491
- IUPAC Standard InChIKey: XURVRZSODRHRNK-UHFFFAOYSA-N
- CAS Registry Number: 32714-83-3
- Chemical structure:
View 3d structure (requires JavaScript / HTML 5) - Species with the same structure:

Gas phase ion energetics data

Data compiled by: John E. Bartmess
Electron affinity determinations
EA (eV) | Method | Reference | Comment |
---|---|---|---|
0.9190 ± 0.0080 | LPES | Wenthold, Kim, et al., 1997 | Triplet state. Singlet state is 9.6±0.2 kcal/mol up. |

Vibrational and/or electronic energy levels

Data compiled by: Marilyn E. Jacox
State: b
Energy (cm-1) |
Med. | Transition | λmin (nm) |
λmax (nm) |
References | ||
---|---|---|---|---|---|---|---|
To = 7520 | U | gas | Wenthold, Kim, et al., 1997 | ||||
State: a
Energy (cm-1) |
Med. | Transition | λmin (nm) |
λmax (nm) |
References | ||
---|---|---|---|---|---|---|---|
To = 3350 ± 65 | gas | Wenthold, Kim, et al., 1997 | |||||
Vib. sym. |
No. | Approximate type of mode |
cm-1 | Med. | Method | References | |
---|---|---|---|---|---|---|---|
a1 | 1260 ± 40 | gas | PE | Wenthold, Kim, et al., 1997 | |||
1000 ± 40 | gas | PE | Wenthold, Kim, et al., 1997 | ||||
265 ± 20 | gas | PE | Wenthold, Kim, et al., 1997 | ||||
State: X
Vib. sym. |
No. | Approximate type of mode |
cm-1 | Med. | Method | References | |
---|---|---|---|---|---|---|---|
a1 | CH2 scissors | 1500 ± 40 | gas | PE | Wenthold, Kim, et al., 1997 | ||
Ring deform. | 540 ± 20 | gas | PE | Wenthold, Kim, et al., 1997 | |||
Ring=C bend | 290 ± 20 | gas | PE | Wenthold, Kim, et al., 1997 | |||
Additional references: Jacox, 1998, page 351

References

Wenthold, Kim, et al., 1997
Wenthold, P.G.; Kim, J.B.; Lineberger, W.C.,
Photoelectron Spectroscopy of m-Xylylene Anion,
J. Am. Chem. Soc., 1997, 119, 6, 1354, https://doi.org/10.1021/ja9623830
. [all data]