Octachlorodibenzo-p-dioxin
- Formula: C12Cl8O2
- Molecular weight: 459.751
- IUPAC Standard InChIKey: FOIBFBMSLDGNHL-UHFFFAOYSA-N
- CAS Registry Number: 3268-87-9
- Chemical structure:
View 3d structure (requires JavaScript / HTML 5) - Other names: Dibenzo[b,e][1,4]dioxin, octachloro-; Dibenzo-p-dioxin, octachloro-; Octachloro-p-dibenzodioxin; 1,2,3,4,6,7,8,9-Octachlorodibenzo-p-dioxin; 1,2,3,4,6,7,8,9-Octachorodibenzo-p-dioxin; Dibenzo-p-dioxin, 1,2,3,4,6,7,8,9-octachloro-; NCI-C03678; Octachlorodibenzodioxin; Octachlorodibenzo(b,e)(1,4)dioxin; OCDD; 1,2,3,4,6,7,8,9-Octachlorodibenzodioxin; 1,2,3,4,6,7,8,9-Octachlorodibenzo[1,4]dioxin; NSC 37651

Phase change data

Data compiled by: William E. Acree, Jr., James S. Chickos
Enthalpy of sublimation
ΔsubH (kJ/mol) | Temperature (K) | Method | Reference | Comment |
---|---|---|---|---|
145.7 ± 4.0 | 478. | ME | Li, Shibata, et al., 2004 | Based on data from 463. to 493. K. |
149.8 | 483. | T | Rordorf, 1989 | Based on data from 393. to 573. K. See also Rordorf, 1986. |

References

Li, Shibata, et al., 2004
Li, Xian-Wei; Shibata, Etsuro; Kasai, Eiki; Nakamura, Takashi,
VAPOR PRESSURES AND ENTHALPIES OF SUBLIMATION OF 17 POLYCHLORINATED DIBENZO-p-DIOXINS AND FIVE POLYCHLORINATED DIBENZOFURANS,
Environ Toxicol Chem, 2004, 23, 2, 348-808, https://doi.org/10.1897/03-193
. [all data]
Rordorf, 1989
Rordorf, Berchtold F.,
Prediction of vapor pressures, boiling points and enthalpies of fusion for twenty-nine halogenated dibenzo-p-dioxins and fifty-five dibenzofurans by a vapor pressure correlation method,
Chemosphere, 1989, 18, 1-6, 783-788, https://doi.org/10.1016/0045-6535(89)90196-3
. [all data]
Rordorf, 1986
Rordorf, Berchtold F.,
Thermal properties of dioxins, furans and related compounds,
Chemosphere, 1986, 15, 9-12, 1325-1332, https://doi.org/10.1016/0045-6535(86)90407-8
. [all data]