Benzhydryl 2-chloroethyl ether
- Formula: C15H15ClO
- Molecular weight: 246.732
- IUPAC Standard InChIKey: ZNVASENTCOLNJT-UHFFFAOYSA-N
- CAS Registry Number: 32669-06-0
- Chemical structure:
View 3d structure (requires JavaScript / HTML 5) - Other names: Benzhydryl β-chloroethyl ether; Benzene, 1,1'-[(2-chloroethoxy)methylene]bis-

Phase change data

Data compiled by: Robert L. Brown and Stephen E. Stein
Reduced pressure boiling point
Tboil (K) | Pressure (bar) | Reference |
---|---|---|
447. to 450. | 0.005 | Frinton Laboratories Inc., 1986 |

References

Frinton Laboratories Inc., 1986
Frinton Laboratories Inc.,
Catalog Number 11, Frinton Laboratories Inc., Vineland, NJ, 1986, 99. [all data]