Butanoic acid, 3-methyl-, 1-methylethyl ester
- Formula: C8H16O2
- Molecular weight: 144.2114
- IUPAC Standard InChIKey: ZOIRKXLFEHOVER-UHFFFAOYSA-N
- CAS Registry Number: 32665-23-9
- Chemical structure:
View 3d structure (requires JavaScript / HTML 5) - Other names: iso-Propyl iso-valerate; Isopropyl 3-methylbutanoate; Isopropyl isopentanoate; isopropyl 3-methylbutyrate

Phase change data

Data compiled by: Thermodynamics Research Center, NIST Boulder Laboratories, Chris Muzny director
Quantity | Value | Units | Method | Reference | Comment |
---|---|---|---|---|---|
Tboil | 141.8 | K | N/A | Munch, 1926 | Uncertainty assigned by TRC = 0.3 K |

References

Munch, 1926
Munch, J.C.,
The Refractometric Determination of Alcohols and Esters in Aqueous and in Cottonseed Oil Solutions,
J. Am. Chem. Soc., 1926, 48, 994-1003. [all data]