2,3-Epoxybutane
- Formula: C4H8O
- Molecular weight: 72.1057
- IUPAC Standard InChIKey: PQXKWPLDPFFDJP-UHFFFAOYSA-N
- CAS Registry Number: 3266-23-7
- Chemical structure:
View 3d structure (requires JavaScript / HTML 5) - Species with the same structure:
- Stereoisomers:
- Other names: Oxirane, 2,3-dimethyl-; Butane, 2,3-epoxy-; β-Butylene oxide; β-Oxybutene; 2-Butene epoxide; 2-Butene oxide; 2,3-Butylene oxide; 2,3-Dimethyloxirane; 2-Butene expoxide; 2,3-Dimethyloxirane, # 2; 2,3-Dimethyloxirane, # 1

Phase change data

Data compiled as indicated in comments:
BS - Robert L. Brown and Stephen E. Stein
TRC - Thermodynamics Research Center, NIST Boulder Laboratories, Chris Muzny director
Quantity | Value | Units | Method | Reference | Comment |
---|---|---|---|---|---|
Tboil | 331. to 334. | K | N/A | Farchan Laboratories, 1990 | BS |
Tboil | 329. | K | N/A | Henry, 1907 | Uncertainty assigned by TRC = 4. K; TRC |

Normal alkane RI, non-polar column, isothermal

Column type | Active phase | Temperature (C) | I | Reference | Comment |
---|---|---|---|---|---|
Capillary | Methyl Silicone | 60. | 512. | Cao and Zhang, 2006 | Column length: 50. m; Column diameter: 0.25 mm |
Capillary | Methyl Silicone | 70. | 511. | Cao and Zhang, 2006 | Column length: 50. m; Column diameter: 0.25 mm |
Capillary | Methyl Silicone | 80. | 511. | Cao and Zhang, 2006 | Column length: 50. m; Column diameter: 0.25 mm |
Capillary | Methyl Silicone | 60. | 539. | Cao and Zhang, 2006 | Column length: 50. m; Column diameter: 0.25 mm |
Capillary | Methyl Silicone | 70. | 539. | Cao and Zhang, 2006 | Column length: 50. m; Column diameter: 0.25 mm |
Capillary | Methyl Silicone | 80. | 539. | Cao and Zhang, 2006 | Column length: 50. m; Column diameter: 0.25 mm |

References

Farchan Laboratories, 1990
Farchan Laboratories,
Research Chemicals Catalog, Farchan Laboratories, Gainesville, FL, 1990, 91. [all data]
Henry, 1907
Henry, L.,
C. R. Hebd. Seances Acad. Sci., 1907, 145, 406. [all data]