Ethyl geranate
- Formula: C12H20O2
- Molecular weight: 196.2860
- IUPAC Standard InChIKey: ZPKNTCZTABQJPS-PKNBQFBNSA-N
- CAS Registry Number: 32659-21-5
- Chemical structure:
View 3d structure (requires JavaScript / HTML 5) - Stereoisomers:
- Other names: 2,6-Octadienoic acid, 3,7-dimethyl-, ethyl ester, (E)-; (E)-3,7-Dimethyl-2,6-octadienoic acid, ethyl ester; Ethyl (2E)-3,7-dimethyl-2,6-octadienoate; E-Ethyl geranate; Ethyl (E)-3,7-dimethylocta-2,6-dienoate; Ethyl trans-geraniate

Kovats' RI, non-polar column, isothermal

Column type | Active phase | Temperature (C) | I | Reference | Comment |
---|---|---|---|---|---|
Capillary | Apiezon L | 190. | 1347. | Kováts, 1987 | |
Capillary | Apiezon L | 190. | 1354. | Kováts, 1987 |

Kovats' RI, non-polar column, temperature ramp

Column type | Active phase | I | Reference | Comment |
---|---|---|---|---|
Capillary | CP Sil 8 CB | 1399. | Tayoub, Schwob, et al., 2006 | 30. m/0.25 mm/0.25 μm, H2, 50. C @ 2. min, 3. K/min; Tend: 220. C |

Van Den Dool and Kratz RI, non-polar column, temperature ramp

Column type | Active phase | I | Reference | Comment |
---|---|---|---|---|
Capillary | Equity-5 | 1332. | Rocha, Coelho, et al., 2007 | 60. m/0.25 mm/1. μm, He, 40. C @ 1. min, 5. K/min, 260. C @ 15. min |

Van Den Dool and Kratz RI, polar column, custom temperature program

Column type | Active phase | I | Reference | Comment |
---|---|---|---|---|
Capillary | Supelcowax-10 | 1762. | Chisholm, Wilson, et al., 2001 | Program: not specified |

References

Kováts, 1987
Kováts, E.,
Composition of essential oils. Part 7. Bulgarian oil of rose (Rosa damascena Mill.),
J. Chromatogr., 1987, 406, 185-222. [all data]
Tayoub, Schwob, et al., 2006
Tayoub, G.; Schwob, I.; Bessière, J.-M.; Rabier, J.; Masotti, V.; J.; M.; Girard, G.; Viano, J.,
Essential oil composition of leaf, flower and stem of Styrax (Styrax officinalis L.) from south-eastern France,
Flavour Fragr. J., 2006, 21, 5, 809-812, https://doi.org/10.1002/ffj.1731
. [all data]
Rocha, Coelho, et al., 2007
Rocha, S.M.; Coelho, E.; Zrostlikova, J.; Delgadillo, I.; Coimbra b, M.A.,
Comprehensive two-dimensional gas chromatography with time-of-flight mass spectrometry of monoterpenoids as a powerful tool for grape origin traceability,
J. Chromatogr. A, 2007, 1161, 1-2, 292-299, https://doi.org/10.1016/j.chroma.2007.05.093
. [all data]
Chisholm, Wilson, et al., 2001
Chisholm, M.G.; Wilson, M.A.; Gaskey, G.M.; Jell, J.A.; Cass, D.M., Jr.,
Chapter 9. The identification of aroma compounds in key lime oil using solid-phase microextraction and gas chromatography-olfactometry,
Am. Chem. Soc. Symp. Ser., 2001, 782, 100-112. [all data]