trans-1-Bromo-1-butene
- Formula: C4H7Br
- Molecular weight: 135.002
- IUPAC Standard InChIKey: IUXHPSPHPKXTPA-ONEGZZNKSA-N
- CAS Registry Number: 32620-08-9
- Chemical structure:
View 3d structure (requires JavaScript / HTML 5) - Species with the same structure:
- Stereoisomers:

Phase change data

Data compiled as indicated in comments:
BS - Robert L. Brown and Stephen E. Stein
TRC - Thermodynamics Research Center, NIST Boulder Laboratories, Chris Muzny director
AC - William E. Acree, Jr., James S. Chickos
Quantity | Value | Units | Method | Reference | Comment |
---|---|---|---|---|---|
Tboil | 367.9 | K | N/A | Weast and Grasselli, 1989 | BS |
Tboil | 367.85 | K | N/A | Timmermans, 1927 | Uncertainty assigned by TRC = 0.5 K; source of data not clear; TRC |
Enthalpy of vaporization
ΔvapH (kJ/mol) | Temperature (K) | Method | Reference | Comment |
---|---|---|---|---|
36.1 | 249. | A | Stephenson and Malanowski, 1987 | Based on data from 234. to 368. K. See also Stull, 1947.; AC |

Reaction thermochemistry data

Data compiled by: Hussein Y. Afeefy, Joel F. Liebman, and Stephen E. Stein
Individual Reactions
By formula: C4H7Br = C4H7Br
Quantity | Value | Units | Method | Reference | Comment |
---|---|---|---|---|---|
ΔrH° | -1.46 | kJ/mol | Eqk | Sharonov, Rozhnov, et al., 1975 | gas phase |

References

Weast and Grasselli, 1989
CRC Handbook of Data on Organic Compounds, 2nd Editon, Weast,R.C and Grasselli, J.G., ed(s)., CRC Press, Inc., Boca Raton, FL, 1989, 1. [all data]
Timmermans, 1927
Timmermans, J.,
The Melting Point of Organic Substances,
Bull. Soc. Chim. Belg., 1927, 36, 502. [all data]
Stephenson and Malanowski, 1987
Stephenson, Richard M.; Malanowski, Stanislaw,
Handbook of the Thermodynamics of Organic Compounds, 1987, https://doi.org/10.1007/978-94-009-3173-2
. [all data]
Stull, 1947
Stull, Daniel R.,
Vapor Pressure of Pure Substances. Organic and Inorganic Compounds,
Ind. Eng. Chem., 1947, 39, 4, 517-540, https://doi.org/10.1021/ie50448a022
. [all data]
Sharonov, Rozhnov, et al., 1975
Sharonov, K.G.; Rozhnov, A.M.; Brezhneva, V.G.; Shishinova, V.I.,
Equilibrium of isomerization of geometric forms of 1-bromo-1-butene and 2-bromo-2-butene,
Izv. Vyssh. Uchebn. Zaved., Khim. Khim. Tekhnol., 1975, 18, 786-788. [all data]