Pyridine, 2-methyl-5-phenyl-
- Formula: C12H11N
- Molecular weight: 169.2224
- IUPAC Standard InChIKey: JXNAIOCJWBJGFQ-UHFFFAOYSA-N
- CAS Registry Number: 3256-88-0
- Chemical structure:
View 3d structure (requires JavaScript / HTML 5) - Other names: 2-Picoline, 5-phenyl-; 2-Methyl-5-phenylpyridine

Van Den Dool and Kratz RI, polar column, temperature ramp

Column type | Active phase | I | Reference | Comment |
---|---|---|---|---|
Capillary | Supelcowax-10 | 2282. | Chung, 1999 | 60. m/0.25 mm/0.25 μm, He, 35. C @ 5. min, 2. K/min, 195. C @ 90. min |

Normal alkane RI, non-polar column, temperature ramp

Column type | Active phase | I | Reference | Comment |
---|---|---|---|---|
Capillary | SPB-1 | 1513. | Thomas and Bassols, 1992 | 5. K/min; Column length: 60. m; Tstart: 80. C; Tend: 230. C |

Normal alkane RI, polar column, temperature ramp

Column type | Active phase | I | Reference | Comment |
---|---|---|---|---|
Capillary | AT-Wax | 2274. | Kiss, Csoka, et al., 2011 | 60. m/0.25 mm/0.25 μm, Helium, 4. K/min; Tstart: 60. C; Tend: 280. C |
Capillary | Supelcowax | 2332. | Thomas and Bassols, 1992 | 5. K/min; Column length: 60. m; Tstart: 80. C; Tend: 230. C |

References

Chung, 1999
Chung, H.Y.,
Volatile components in crabmeats of Charybdis feriatus,
J. Agric. Food Chem., 1999, 47, 6, 2280-2287, https://doi.org/10.1021/jf981027t
. [all data]
Thomas and Bassols, 1992
Thomas, A.F.; Bassols, F.,
Occurrence of pyridines and other bases in orange oil,
J. Agric. Food Chem., 1992, 40, 11, 2236-2243, https://doi.org/10.1021/jf00023a037
. [all data]
Kiss, Csoka, et al., 2011
Kiss, M.; Csoka, M.; Gyorfi, J.; Korany, K.,
Comparison of the fragrance constituents of Tuber aestivium and Tuber Brumale gathered in Hungary,
J. Appl. Botany Food Quality, 2011, 84, 102-110. [all data]