2,3,5-trimethyl-2-hexene
- Formula: C9H18
- Molecular weight: 126.2392
- IUPAC Standard InChIKey: ZPUQPCQFHKREMH-UHFFFAOYSA-N
- CAS Registry Number: 32540-07-1
- Chemical structure:
View 3d structure (requires JavaScript / HTML 5) - Permanent link for this species. Use this link for bookmarking this species for future reference.

Phase change data

Data compiled by: Thermodynamics Research Center, NIST Boulder Laboratories, Chris Muzny director
Quantity | Value | Units | Method | Reference | Comment |
---|---|---|---|---|---|
Tboil | 410.5 | K | N/A | Cline, 1940 | Uncertainty assigned by TRC = 1. K |
Quantity | Value | Units | Method | Reference | Comment |
Tfus | 161.8 | K | N/A | Cline, 1939 | Uncertainty assigned by TRC = 2. K |

References

Cline, 1940
Cline, E.T.,
, PhD Thesis, 1940. [all data]
Cline, 1939
Cline, E.T.,
The Synthesis of Type III and Type V Olefins from Dimethylbutadien- monohydrobromide, Ph.D. Dissertation, Ohio State Univ., Columbus, OH, 1939. [all data]