Butyl 1,1-dimethylpropyl ether
- Formula: C9H20O
- Molecular weight: 144.2545
- IUPAC Standard InChIKey: FTGPSKPJRKRPSX-UHFFFAOYSA-N
- CAS Registry Number: 3249-47-6
- Chemical structure:
View 3d structure (requires JavaScript / HTML 5) - Species with the same structure:

Gas phase thermochemistry data

Data compiled by: Hussein Y. Afeefy, Joel F. Liebman, and Stephen E. Stein
Quantity | Value | Units | Method | Reference | Comment |
---|---|---|---|---|---|
ΔfH°gas | -382.2 ± 0.93 | kJ/mol | Ccb | Verevkin, Beckhaus, et al., 1996 |

Condensed phase thermochemistry data

Data compiled by: Hussein Y. Afeefy, Joel F. Liebman, and Stephen E. Stein
Quantity | Value | Units | Method | Reference | Comment |
---|---|---|---|---|---|
ΔfH°liquid | -428.34 ± 0.90 | kJ/mol | Ccb | Verevkin, Beckhaus, et al., 1996 | |
Quantity | Value | Units | Method | Reference | Comment |
ΔcH°liquid | -5971.54 ± 0.90 | kJ/mol | Ccb | Verevkin, Beckhaus, et al., 1996 | Corresponding ΔfHºliquid = -428.35 kJ/mol (simple calculation by NIST; no Washburn corrections) |

Phase change data

Data compiled as indicated in comments:
AC - William E. Acree, Jr., James S. Chickos
ALS - Hussein Y. Afeefy, Joel F. Liebman, and Stephen E. Stein
Quantity | Value | Units | Method | Reference | Comment |
---|---|---|---|---|---|
ΔvapH° | 48.3 | kJ/mol | N/A | Verevkin, 2002 | See also Verevkin, Krasnykh, et al., 2003.; AC |
ΔvapH° | 46.14 ± 0.25 | kJ/mol | V | Verevkin, Beckhaus, et al., 1996 | ALS |
ΔvapH° | 46.1 ± 0.3 | kJ/mol | GS | Verevkin, Beckhaus, et al., 1996 | Based on data from 278. to 308. K.; AC |

References

Verevkin, Beckhaus, et al., 1996
Verevkin, S.P.; Beckhaus, H.-D.; Belen'kaja, R.S.; Rakus, K.; Ruchardt, C.,
Geminal substituent effects Part 9. Standard enthalpies of formation and strain free increments of branched esters and ethers,
Thermochim. Acta, 1996, 279, 47-64. [all data]
Verevkin, 2002
Verevkin, Sergey P.,
Improved Benson Increments for the Estimation of Standard Enthalpies of Formation and Enthalpies of Vaporization of Alkyl Ethers, Acetals, Ketals, and Ortho Esters,
J. Chem. Eng. Data, 2002, 47, 5, 1071-1097, https://doi.org/10.1021/je020023o
. [all data]
Verevkin, Krasnykh, et al., 2003
Verevkin, Sergey P.; Krasnykh, Eugen L.; Vasiltsova, Tatiana V.; Heintz, Andreas,
Determination of Ambient Temperature Vapor Pressures and Vaporization Enthalpies of Branched Ethers,
J. Chem. Eng. Data, 2003, 48, 3, 591-599, https://doi.org/10.1021/je0255980
. [all data]