4-Ethylphenyl acetate
- Formula: C10H12O2
- Molecular weight: 164.2011
- IUPAC Standard InChIKey: ANMYMLIUCWWISO-UHFFFAOYSA-N
- CAS Registry Number: 3245-23-6
- Chemical structure:
View 3d structure (requires JavaScript / HTML 5) - Other names: Phenol, 4-ethyl-, acetate; 1-Acetoxy-4-ethylbenzene; p-ethylphenyl acetate

Normal alkane RI, polar column, temperature ramp

Column type | Active phase | I | Reference | Comment |
---|---|---|---|---|
Capillary | DB-Wax | 1784. | Zhao, Xu, et al., 2009 | 30. m/0.25 mm/0.25 μm, Helium, 40. C @ 2. min, 3. K/min, 230. C @ 5. min |

References

Zhao, Xu, et al., 2009
Zhao, Y.; Xu, Y.; Li, J.; Fan, W.; Jiang, W.,
Profile of volatile compounds in 11 brandies by headspace solid-phase microextraction followed by gas chromatography-mass spectrometry,
J. Food. Sci., 2009, 74, 2, c90-c99, https://doi.org/10.1111/j.1750-3841.2008.01029.x
. [all data]