4-Heptyn-3-ol
- Formula: C7H12O
- Molecular weight: 112.1696
- IUPAC Standard InChIKey: FMOKAMXPKGORIR-UHFFFAOYSA-N
- CAS Registry Number: 32398-69-9
- Chemical structure:
View 3d structure (requires JavaScript / HTML 5) - Permanent link for this species. Use this link for bookmarking this species for future reference.

Phase change data

Data compiled by: Robert L. Brown and Stephen E. Stein
Reduced pressure boiling point
Tboil (K) | Pressure (bar) | Reference |
---|---|---|
368. | 0.072 | Farchan Laboratories, 1990 |

References

Farchan Laboratories, 1990
Farchan Laboratories,
Research Chemicals Catalog, Farchan Laboratories, Gainesville, FL, 1990, 91. [all data]