2,5-Furandicarboxylic acid

Phase change data

Data compiled by: William E. Acree, Jr., James S. Chickos

Enthalpy of sublimation

ΔsubH (kJ/mol) Temperature (K) Method Reference Comment
121.3391.TE,MESpencer and Cliath, 1983Based on data from 378. - 402. K.

References

Spencer and Cliath, 1983
Spencer, W.F.; Cliath, M.M., Measurement of pesticide vapor pressures, 1983, 57-71, https://doi.org/10.1007/978-1-4612-5462-16 . [all data]

Andrisano and Tundo, 1951
Andrisano, R.; Tundo, A., Gazz. chim. ital., 1951, 81, 414. [all data]