Phenol, 2,3,4,6-tetramethyl-
- Formula: C10H14O
- Molecular weight: 150.2176
- IUPAC Standard InChIKey: WEJVHFVGNQBRGH-UHFFFAOYSA-N
- CAS Registry Number: 3238-38-8
- Chemical structure:
View 3d structure (requires JavaScript / HTML 5) - Other names: 2,3,4,6-Tetramethylphenol

Phase change data

Data compiled by: Thermodynamics Research Center, NIST Boulder Laboratories, Chris Muzny director
Quantity | Value | Units | Method | Reference | Comment |
---|---|---|---|---|---|
Tboil | 523.15 | K | N/A | Karr, Estep, et al., 1961 | Uncertainty assigned by TRC = 4. K |
Tboil | 523.15 | K | N/A | Karr, 1957 | Uncertainty assigned by TRC = 4. K |
Quantity | Value | Units | Method | Reference | Comment |
Tfus | 353.15 | K | N/A | Karr, 1957 | Uncertainty assigned by TRC = 2. K |

References

Karr, Estep, et al., 1961
Karr, C.; Estep, P.A.; Chang, T.-C.L.; Comberiati, H.R.,
, U. S. Bur. Mines, Bull. 591, 1961. [all data]
Karr, 1957
Karr, C.,
, U. S. Bur. Mines, Inform. Circ. IC 7802, 1957. [all data]