Naphthalene, 2-ethyl-1,2,3,4-tetrahydro-
- Formula: C12H16
- Molecular weight: 160.2554
- IUPAC Standard InChIKey: JUANVGODPSRCGD-UHFFFAOYSA-N
- CAS Registry Number: 32367-54-7
- Chemical structure:
View 3d structure (requires JavaScript / HTML 5) - Other names: 2-Ethyltetralin; Tetraline, 2-ethyl; 2-Ethyl-1,2,3,4-tetrahydronaphthalene

Van Den Dool and Kratz RI, non-polar column, temperature ramp

Column type | Active phase | I | Reference | Comment |
---|---|---|---|---|
Capillary | Petrocol DH | 1313. | White, Hackett, et al., 1992 | 100. m/0.25 mm/0.5 μm, He, 1. K/min; Tstart: 30. C; Tend: 220. C |

Normal alkane RI, non-polar column, isothermal

Column type | Active phase | Temperature (C) | I | Reference | Comment |
---|---|---|---|---|---|
Packed | Polydimethyl siloxane | 147. | 1324. | Ferrand, 1962 |

References

White, Hackett, et al., 1992
White, C.M.; Hackett, J.; Anderson, R.R.; Kail, S.; Spock, P.S.,
Linear temperature programmed retention indices of gasoline range hydrocarbons and chlorinated hydrocarbons on cross-linked polydimethylsiloxane,
J. Hi. Res. Chromatogr., 1992, 15, 2, 105-120, https://doi.org/10.1002/jhrc.1240150211
. [all data]
Ferrand, 1962
Ferrand, R.,
Gas phase chromatography using retention indices for the analysis of tars and their hydrogenation products,
Journees internationales d'etude des methodes de separation immediate at de chromatographie; Org. sur l'initiative du IX., 1962, 132-140. [all data]