N,N-Bis(2-hydroxyethyl)-m-fluoroaniline
- Formula: C10H14FNO2
- Molecular weight: 199.2221
- IUPAC Standard InChIKey: GFXQBWUWIQBIKN-UHFFFAOYSA-N
- CAS Registry Number: 323-60-4
- Chemical structure:
View 3d structure (requires JavaScript / HTML 5) - Permanent link for this species. Use this link for bookmarking this species for future reference.

Phase change data

Data compiled by: Robert L. Brown and Stephen E. Stein
Reduced pressure boiling point
Tboil (K) | Pressure (bar) | Reference |
---|---|---|
458. to 459. | 0.001 | Frinton Laboratories Inc., 1986 |

References

Frinton Laboratories Inc., 1986
Frinton Laboratories Inc.,
Catalog Number 11, Frinton Laboratories Inc., Vineland, NJ, 1986, 99. [all data]