Myristyl myristate

Van Den Dool and Kratz RI, non-polar column, temperature ramp

View large format table.

Column type Active phase I Reference Comment
CapillaryUltra-12947.Tokuda, Saitoh, et al., 198812.5 m/0.20 mm/0.11 μm, He, 5. K/min, 325. C @ 5. min; Tstart: 120. C
CapillaryUltra-12946.Tokuda, Saitoh, et al., 198812.5 m/0.20 mm/0.11 μm, He, 5. K/min, 325. C @ 5. min; Tstart: 120. C

Normal alkane RI, non-polar column, temperature ramp

View large format table.

Column type Active phase I Reference Comment
CapillaryDB-1MS2950.07Stransky, Zarevucka, et al., 200630. m/0.252 mm/0.25 μm, H2, 1. K/min; Tstart: 240. C; Tend: 340. C

References

Tokuda, Saitoh, et al., 1988
Tokuda, H.; Saitoh, E.; Kimura, Y.; Takano, S., Automated analysis of various compounds with a wide range of boiling points by capillary gas chromatgraphy based on retention indices, J. Chromatogr., 1988, 454, 109-120, https://doi.org/10.1016/S0021-9673(00)88606-9 . [all data]

Stransky, Zarevucka, et al., 2006
Stransky, K.; Zarevucka, M.; Valterova, I.; Wimmer, Z., Gas chromatographic retention data of wax esters, J. Chromatogr. A, 2006, 1128, 1-2, 208-219, https://doi.org/10.1016/j.chroma.2006.06.035 . [all data]