1,2-Dibromopentane
- Formula: C5H10Br2
- Molecular weight: 229.941
- IUPAC Standard InChIKey: CITMYAPULDSOHG-UHFFFAOYSA-N
- CAS Registry Number: 3234-49-9
- Chemical structure:
View 3d structure (requires JavaScript / HTML 5) - Other names: Pentane, 1,2-dibromo-

Condensed phase thermochemistry data

Data compiled by: Hussein Y. Afeefy, Joel F. Liebman, and Stephen E. Stein
Quantity | Value | Units | Method | Reference | Comment |
---|---|---|---|---|---|
ΔfH°liquid | -164.8 | kJ/mol | Eqk | Rozhnov, Alenin, et al., 1974 |

Phase change data

Data compiled as indicated in comments:
AC - William E. Acree, Jr., James S. Chickos
Quantity | Value | Units | Method | Reference | Comment |
---|---|---|---|---|---|
ΔvapH° | 49. | kJ/mol | N/A | Pisarev, Rozhnov, et al., 1975 | Based on data from 350. to 450. K. See also Basarová and Svoboda, 1991.; AC |
ΔvapH° | 49.2 ± 0.8 | kJ/mol | EB | Pisarev, Rozhnov, et al., 1975 | AC |
Enthalpy of vaporization
ΔvapH (kJ/mol) | Temperature (K) | Method | Reference | Comment |
---|---|---|---|---|
46.5 | 363. | A | Stephenson and Malanowski, 1987 | Based on data from 348. to 465. K.; AC |
48.8 | 307. | A | Stephenson and Malanowski, 1987 | Based on data from 292. to 448. K. See also Stull, 1947.; AC |
Antoine Equation Parameters
log10(P) = A − (B / (T + C))
P = vapor pressure (bar)
T = temperature (K)
View plot Requires a JavaScript / HTML 5 canvas capable browser.
Temperature (K) | A | B | C | Reference | Comment |
---|---|---|---|---|---|
292.9 to 448. | 4.63914 | 1875.567 | -43.328 | Stull, 1947 | Coefficents calculated by NIST from author's data. |

Reaction thermochemistry data

Data compiled by: Hussein Y. Afeefy, Joel F. Liebman, and Stephen E. Stein
Individual Reactions
By formula: C5H10Br2 = C5H10Br2
Quantity | Value | Units | Method | Reference | Comment |
---|---|---|---|---|---|
ΔrH° | -5.9 ± 0.4 | kJ/mol | Eqk | Rozhnov, Nesterova, et al., 1974 | liquid phase; Heat of isomerization |

Kovats' RI, non-polar column, isothermal

Column type | Active phase | Temperature (C) | I | Reference | Comment |
---|---|---|---|---|---|
Capillary | Squalane | 115. | 1033. | Lafosse and Thuaud-Chourrout, 1975 | Column length: 100. m; Column diameter: 0.25 mm |

Normal alkane RI, non-polar column, isothermal

Column type | Active phase | Temperature (C) | I | Reference | Comment |
---|---|---|---|---|---|
Capillary | Apiezon L | 130. | 1056. | Arruda, Junkes, et al., 2008 |

Normal alkane RI, non-polar column, temperature ramp

Column type | Active phase | I | Reference | Comment |
---|---|---|---|---|
Capillary | HP-PONA | 1033. | Liu and Yang, 2003 | 50. m/0.20 mm/0.50 μm, 35. C @ 8. min, 3.5 K/min, 230. C @ 10. min |

References

Rozhnov, Alenin, et al., 1974
Rozhnov, A.M.; Alenin, V.I.; Nesterova, T.N.,
Equilibrium in the isomerisation of dibromoalkanes. IV. Isomerisation of dibromohexanes and heats of formation of certain C5-C10 dibromoalkanes,
Russ. J. Phys. Chem. (Engl. Transl.), 1974, 48, 1701-1702. [all data]
Pisarev, Rozhnov, et al., 1975
Pisarev, V.V.; Rozhnov, A.M.; Varushchenko, R.M.; Sarkisov, A.G.,
Russ. J. Phys. Chem., 1975, 49, 1450. [all data]
Basarová and Svoboda, 1991
Basarová, Pavlína; Svoboda, Václav,
Calculation of heats of vaporization of halogenated hydrocarbons from saturated vapour pressure data,
Fluid Phase Equilibria, 1991, 68, 13-34, https://doi.org/10.1016/0378-3812(91)85008-I
. [all data]
Stephenson and Malanowski, 1987
Stephenson, Richard M.; Malanowski, Stanislaw,
Handbook of the Thermodynamics of Organic Compounds, 1987, https://doi.org/10.1007/978-94-009-3173-2
. [all data]
Stull, 1947
Stull, Daniel R.,
Vapor Pressure of Pure Substances. Organic and Inorganic Compounds,
Ind. Eng. Chem., 1947, 39, 4, 517-540, https://doi.org/10.1021/ie50448a022
. [all data]
Rozhnov, Nesterova, et al., 1974
Rozhnov, A.M.; Nesterova, T.N.; Alenin, V.I.; Uskova, L.A.,
Equilibria in the isomerisation of dibromoalkanes. I. Isomerisation of 1,2-, 1,3-, 1,4-, and 1,5-dibromopentanes,
Russ. J. Phys. Chem. (Engl. Transl.), 1974, 48, 1268, In original 2136. [all data]
Lafosse and Thuaud-Chourrout, 1975
Lafosse, M.; Thuaud-Chourrout, N.,
Etude du comportement de composés halogénés et mèthoxylés en CG dans le cas de quatre phases stationnaires liquides pouvant former des liaisons de type donneur-accepteur d'électrons avec les groupes fonctionnels de ces composés,
Chromatographia, 1975, 8, 4, 195-202, https://doi.org/10.1007/BF02274456
. [all data]
Arruda, Junkes, et al., 2008
Arruda, A.C.S.; Junkes, B. da.S.; Souza, E.S.; Yunes, R.A.; Heizen, V.E.F.,
Semi-Emlirical Topological Index to Predict Properties of Halogenated Aliphatic Compounds,
J. Chemometrics, 2008, 22, 3-4, 186-194, https://doi.org/10.1002/cem.1121
. [all data]
Liu and Yang, 2003
Liu, Y.; Yang, H.,
Detailed alkene determination by bromination and gas chromatography with atomic emission detection. I. identification of the bromoalkenes/bromoalkanes in brominated gasoline,
Se Pu - Chinese Journal of Chromatography, 2003, 21, 1, 1-8. [all data]