Diacetyl sulphide
- Formula: C4H6O2S
- Molecular weight: 118.154
- IUPAC Standard InChIKey: DPCQJLQPDJPRCM-UHFFFAOYSA-N
- CAS Registry Number: 3232-39-1
- Chemical structure:
View 3d structure (requires JavaScript / HTML 5) - Other names: 1,1'-Thiobis-(ethane-1-one); (CH3CO)2S; Acetyl sulfide; Ethanethioic acid, anhydrosulfide; acetic thioanhydride

Gas phase thermochemistry data

Data compiled by: Hussein Y. Afeefy, Joel F. Liebman, and Stephen E. Stein
Quantity | Value | Units | Method | Reference | Comment |
---|---|---|---|---|---|
ΔfH°gas | -317. ± 10. | kJ/mol | Eqk | Blake and Speis, 1974 | Heat of formation derived by 77PED/RYL |

Phase change data

Data compiled as indicated in comments:
BS - Robert L. Brown and Stephen E. Stein
AC - William E. Acree, Jr., James S. Chickos
Quantity | Value | Units | Method | Reference | Comment |
---|---|---|---|---|---|
Tboil | 392.7 | K | N/A | Aldrich Chemical Company Inc., 1990 | BS |
Enthalpy of vaporization
ΔvapH (kJ/mol) | Temperature (K) | Method | Reference | Comment |
---|---|---|---|---|
54.2 | 340. | N/A | Dykyj, Svoboda, et al., 1999 | Based on data from 325. to 355. K.; AC |
50.9 | 340. | A | Stephenson and Malanowski, 1987 | Based on data from 325. to 355. K.; AC |

Reaction thermochemistry data

Data compiled by: Hussein Y. Afeefy, Joel F. Liebman, and Stephen E. Stein
Individual Reactions
By formula: C4H6O2S = C2H2O + C2H4OS
Quantity | Value | Units | Method | Reference | Comment |
---|---|---|---|---|---|
ΔrH° | 94.7 | kJ/mol | Eqk | Blake and Speis, 1974 | gas phase; Heat of formation derived by 77PED/RYL |
By formula: C2H2O + C2H4OS = C4H6O2S
Quantity | Value | Units | Method | Reference | Comment |
---|---|---|---|---|---|
ΔrH° | -94.7 | kJ/mol | Eqk | Blake and Speis, 1974 | gas phase |

References

Blake and Speis, 1974
Blake, P.G.; Speis, A.,
Reactions of keten. Part IV. Kinetics and thermodynamics of the gas-phase reaction: Thioacetic acid + keten = acetic Thioanhydride,
J. Chem. Soc. Perkin Trans. 2, 1974, 1879-1881. [all data]
Aldrich Chemical Company Inc., 1990
Aldrich Chemical Company Inc.,
Catalog Handbook of Fine Chemicals, Aldrich Chemical Company, Inc., Milwaukee WI, 1990, 1. [all data]
Dykyj, Svoboda, et al., 1999
Dykyj, J.; Svoboda, J.; Wilhoit, R.C.; Frenkel, M.L.; Hall, K.R.,
Vapor Pressure of Chemicals: Part A. Vapor Pressure and Antoine Constants for Hydrocarbons and Sulfur, Selenium, Tellurium and Hydrogen Containing Organic Compounds, Springer, Berlin, 1999, 373. [all data]
Stephenson and Malanowski, 1987
Stephenson, Richard M.; Malanowski, Stanislaw,
Handbook of the Thermodynamics of Organic Compounds, 1987, https://doi.org/10.1007/978-94-009-3173-2
. [all data]