Propane, 1,3-dibromo-2,2-bis(bromomethyl)-
- Formula: C5H8Br4
- Molecular weight: 387.733
- IUPAC Standard InChIKey: OYSVBCSOQFXYHK-UHFFFAOYSA-N
- CAS Registry Number: 3229-00-3
- Chemical structure:
View 3d structure (requires JavaScript / HTML 5) - Other names: Pentaerythritol tetrabromide; Pentaerythrityl bromide; Pentaerythrityl tetrabromide; Tetra(bromomethyl)methane; Tetrabromoneopentane; Tetrakis(bromomethyl)methane; 2,2-Bis(bromomethyl)-1,3-dibromopropane; 1,3-Dibromo-2,2-bis(bromomethyl)propane; NSC 8998

Condensed phase thermochemistry data

Data compiled by: Eugene S. Domalski and Elizabeth D. Hearing
Quantity | Value | Units | Method | Reference | Comment |
---|---|---|---|---|---|
S°solid,1 bar | 297.12 | J/mol*K | N/A | Clever, Wong, et al., 1965 | Based on low temperature data of 62PAY/WES. |
S°solid,1 bar | 291.12 | J/mol*K | N/A | Payne and Westrum, 1962 | |
S°solid,1 bar | 291.12 | J/mol*K | N/A | Westrum, 1959 |
Constant pressure heat capacity of solid
Cp,solid (J/mol*K) | Temperature (K) | Reference | Comment |
---|---|---|---|
218.57 | 298.15 | Clever, Wong, et al., 1965 | T = 250 to 460 K. |
213.80 | 298.15 | Payne and Westrum, 1962 | T = 6 to 300 K. Anomalous region, 260 to 290 K. |
213.80 | 298.15 | Westrum, 1959 | Based on data 10 to 350 K, to be reported elsewhere. |

Phase change data

Data compiled as indicated in comments:
BS - Robert L. Brown and Stephen E. Stein
TRC - Thermodynamics Research Center, NIST Boulder Laboratories, Chris Muzny director
AC - William E. Acree, Jr., James S. Chickos
DH - Eugene S. Domalski and Elizabeth D. Hearing
Quantity | Value | Units | Method | Reference | Comment |
---|---|---|---|---|---|
Tboil | 578.7 | K | N/A | Weast and Grasselli, 1989 | BS |
Quantity | Value | Units | Method | Reference | Comment |
Ttriple | 433.45 | K | N/A | Clever, Wong, et al., 1965, 2 | Uncertainty assigned by TRC = 0.05 K; TRC |
Enthalpy of vaporization
ΔvapH (kJ/mol) | Temperature (K) | Method | Reference | Comment |
---|---|---|---|---|
61.0 | 452. | A | Stephenson and Malanowski, 1987 | Based on data from 439. to 466. K.; AC |
Enthalpy of sublimation
ΔsubH (kJ/mol) | Temperature (K) | Method | Reference | Comment |
---|---|---|---|---|
84.0 | 399. | A | Stephenson and Malanowski, 1987 | Based on data from 384. to 434. K.; AC |
Enthalpy of fusion
ΔfusH (kJ/mol) | Temperature (K) | Reference | Comment |
---|---|---|---|
27.966 | 433.45 | Clever, Wong, et al., 1965 | DH |
27.97 | 433.5 | Domalski and Hearing, 1996 | AC |
Entropy of fusion
ΔfusS (J/mol*K) | Temperature (K) | Reference | Comment |
---|---|---|---|
64.52 | 433.45 | Clever, Wong, et al., 1965 | DH |

References

Clever, Wong, et al., 1965
Clever, H.L.; Wong, W-K.; Westrum, E.F., Jr.,
Heat capacities and thermodynamic properties of globular molecules. XIII. Transition and fusion of pentaerythrityl chloride and bromide, transition of pentaerythrityl iodide,
J. Phys. Chem., 1965, 69, 1209-1213. [all data]
Payne and Westrum, 1962
Payne, D.H.; Westrum, E.F., Jr.,
Heat capacities and thermodynamic properties of globular molecules. IV. Pentaerythrityl chloride, bromide, and iodide from 6 to 300°K,
J. Phys. Chem., 1962, 66, 748-751. [all data]
Westrum, 1959
Westrum, E.F., Jr.,
Ordering transitions in symmetrical molecules, Symp. Thermodynam. Fritens-Wattens,
Tirol Austria, 1959, No.36, 11p. [all data]
Weast and Grasselli, 1989
CRC Handbook of Data on Organic Compounds, 2nd Editon, Weast,R.C and Grasselli, J.G., ed(s)., CRC Press, Inc., Boca Raton, FL, 1989, 1. [all data]
Clever, Wong, et al., 1965, 2
Clever, H.L.; Wong, W.-K.; Westrum, E.F.,
Heat Capacities and Thermodynamic Properties of Globular Molecules. XIII. Transition and Fusion ofPentaerythritol Chloride and Bromide. Transition of Pentaerythritol Iodide,
J. Phys. Chem., 1965, 69, 1209. [all data]
Stephenson and Malanowski, 1987
Stephenson, Richard M.; Malanowski, Stanislaw,
Handbook of the Thermodynamics of Organic Compounds, 1987, https://doi.org/10.1007/978-94-009-3173-2
. [all data]
Domalski and Hearing, 1996
Domalski, Eugene S.; Hearing, Elizabeth D.,
Heat Capacities and Entropies of Organic Compounds in the Condensed Phase. Volume III,
J. Phys. Chem. Ref. Data, 1996, 25, 1, 1, https://doi.org/10.1063/1.555985
. [all data]