Phenol, 2-methyl-6-(1-methylethyl)-

Gas phase thermochemistry data

Data compiled by: Hussein Y. Afeefy, Joel F. Liebman, and Stephen E. Stein

Quantity Value Units Method Reference Comment
Δfgas-190.0kJ/molCcbBertholon, Giray, et al., 1971see Lamartine and Perrin, 1969

Condensed phase thermochemistry data

Data compiled by: Hussein Y. Afeefy, Joel F. Liebman, and Stephen E. Stein

Quantity Value Units Method Reference Comment
Δfliquid-270.kJ/molCcbBertholon, Giray, et al., 1971see Lamartine and Perrin, 1969
Quantity Value Units Method Reference Comment
Δcliquid-5669.kJ/molCcbBertholon, Giray, et al., 1971see Lamartine and Perrin, 1969; Corresponding Δfliquid = -270. kJ/mol (simple calculation by NIST; no Washburn corrections)
Δcliquid-5650. ± 10.kJ/molCcbLamartine and Perrin, 1969Corresponding Δfliquid = -290. kJ/mol (simple calculation by NIST; no Washburn corrections)

References

Bertholon, Giray, et al., 1971
Bertholon, G.; Giray, M.; Perrin, R.; Vincent-Falquet-Berny, M.F., No. 532. - Etude physicochimique des phenols. OX. - Ethanlpies de combustion et energies de resonance des alcoyl et aryphenols, Bull. Soc. Chim. France, 1971, 3180-3187. [all data]

Lamartine and Perrin, 1969
Lamartine, R.; Perrin, R., Etude physiocochimique des phenols. VIII. Caracterisation physicochimique des methyl-2 isopropylphenols ou carvacrols, Bull. Soc. Chim. France, 1969, 10, 443-445. [all data]