3,5-Bis(trifluoromethyl)benzyl bromide
- Formula: C9H5BrF6
- Molecular weight: 307.030
- IUPAC Standard InChIKey: ATLQGZVLWOURFU-UHFFFAOYSA-N
- CAS Registry Number: 32247-96-4
- Chemical structure:
View 3d structure (requires JavaScript / HTML 5) - Other names: 3,5-di(Trifluoromethyl)benzyl bromide; Benzene, 1-(bromomethyl)-3,5-bis(trifluoromethyl)-; 1-(bromomethyl)-3,5-bis(trifluoromethyl)benzene

Normal alkane RI, non-polar column, custom temperature program

Column type | Active phase | I | Reference | Comment |
---|---|---|---|---|
Capillary | Polydimethyl siloxanes | 1103. | Zenkevich, 2001 | Program: not specified |

References

Zenkevich, 2001
Zenkevich, I.G.,
Encyclopedia of Chromatography. Derivatization of Acids for GC Analysis, Marcel Dekker, Inc., New York - Basel, 2001, 221. [all data]