4-tert-Butylcyclohexyl acetate
- Formula: C12H22O2
- Molecular weight: 198.3019
- IUPAC Standard InChIKey: MBZRJSQZCBXRGK-CACVWKRDSA-N
- CAS Registry Number: 32210-23-4
- Chemical structure:
View 3d structure (requires JavaScript / HTML 5) - Stereoisomers:
- Other names: Acetic acid p-tert-butylcyclohexyl ester; Cyclohexanol, 4-(1,1-dimethylethyl)-, acetate; p-tert-Butyl cyclohexyl acetate; Acetic acid, (4-tert-butylcyclohexyl) ester; Cyclohexanol, 4-tert-butyl-, acetate; Vertenex; 4-tert-Butylcyclohexanol acetate; 4-tert-Butylhexahydrophenyl acetate; 4-t-Butylcyclohexyl acetate; Cyclohexanol, 4-(1,1-dimethylethyl)-, 1-acetate; NSC 163103

Kovats' RI, non-polar column, isothermal

Column type | Active phase | Temperature (C) | I | Reference | Comment |
---|---|---|---|---|---|
Capillary | SE-30 | 120. | 1348. | Tudor and Moldovan, 1999 | |
Capillary | SE-30 | 120. | 1352. | Tudor and Moldovan, 1999 | |
Capillary | SE-30 | 120. | 1316. | Tudor and Moldovan, 1999 |

Van Den Dool and Kratz RI, non-polar column, temperature ramp

Column type | Active phase | I | Reference | Comment |
---|---|---|---|---|
Capillary | DB-1 | 1346.0 | Chang, Sheng, et al., 1989 | 2. K/min; Column length: 30. m; Column diameter: 0.25 mm; Tstart: 50. C; Tend: 300. C |
Capillary | DB-1 | 1346.2 | Chang, Sheng, et al., 1989 | 2. K/min; Column length: 30. m; Column diameter: 0.25 mm; Tstart: 50. C; Tend: 300. C |

Normal alkane RI, non-polar column, temperature ramp

Column type | Active phase | I | Reference | Comment |
---|---|---|---|---|
Capillary | 5 % Phenyl methyl siloxane | 1368. | Zellner, Bicchi, et al., 2008 | 30. m/0.25 mm/0.25 μm, 3. K/min; Tstart: 50. C; Tend: 250. C |

Normal alkane RI, non-polar column, custom temperature program

Column type | Active phase | I | Reference | Comment |
---|---|---|---|---|
Capillary | SLB-5 MS | 1368. | Mondello, 2012 | 30. m/0.25 mm/0.25 μm, Helium; Program: not specified |
Capillary | SLB-5 MS | 1373. | Mondello, 2012 | 30. m/0.25 mm/0.25 μm, Helium; Program: not specified |
Capillary | SE-30 | 1304. | Vinogradov, 2004 | Program: not specified |

References

Tudor and Moldovan, 1999
Tudor, E.; Moldovan, D.,
Temperature Dependence of the Retention Index for Perfumery Compounds on a Se-30 Glass Capillary Column. II. The Hyperbolic Equation,
J. Chromatogr., 1999, 848, 1-2, 215-227, https://doi.org/10.1016/S0021-9673(99)00412-4
. [all data]
Chang, Sheng, et al., 1989
Chang, L.P.; Sheng, L.S.; Yang, M.Z.; An, D.K.,
Retention index of essential oil in temperature-programmed capillary column gas chromatography,
Acta Pharm. Sin., 1989, 24, 11, 847-852. [all data]
Zellner, Bicchi, et al., 2008
Zellner, B.d'A.; Bicchi, C.; Dugo, P.; Rubiolo, P.; Dugo, G.; Mondello, L.,
Linear retention indices in gas chromatographic analysis: a review,
Flavour Fragrance J., 2008, 23, 5, 297-314, https://doi.org/10.1002/ffj.1887
. [all data]
Mondello, 2012
Mondello, L.,
HS-SPME-GCxGC-MS analysis of Yerba Mate (Ilex paraguariensis)
in Shimadzu GC-GC application compendium of comprehensive 2D GC, Vol. 1-5, Shimadzu Corp., 2012, 1-29. [all data]
Vinogradov, 2004
Vinogradov, B.A.,
Production, composition, properties and application of essential oils, 2004, retrieved from http://viness.narod.ru. [all data]