2,5-Octanedione
- Formula: C8H14O2
- Molecular weight: 142.1956
- IUPAC Standard InChIKey: SPDFSSLYVRCMDZ-UHFFFAOYSA-N
- CAS Registry Number: 3214-41-3
- Chemical structure:
View 3d structure (requires JavaScript / HTML 5) - Other names: octane-2,5-dione

Phase change data

Data compiled by: Robert L. Brown and Stephen E. Stein
Reduced pressure boiling point
Tboil (K) | Pressure (bar) | Reference |
---|---|---|
371. to 373. | 0.016 | Frinton Laboratories Inc., 1986 |

Van Den Dool and Kratz RI, non-polar column, temperature ramp

Column type | Active phase | I | Reference | Comment |
---|---|---|---|---|
Capillary | Mega 5MS | 980. | Condurso, Verzera, et al., 2006 | 60. m/0.25 mm/0.25 μm, He, 3. K/min; Tstart: 60. C; Tend: 240. C |

Van Den Dool and Kratz RI, non-polar column, custom temperature program

Column type | Active phase | I | Reference | Comment |
---|---|---|---|---|
Capillary | DB-5 | 983. | Beaulieu and Grimm, 2001 | 30. m/0.25 mm/0.25 μm, He; Program: 50C (1min) => 5C/min => 100C => 10C/min => 250C (9min) |

Van Den Dool and Kratz RI, polar column, custom temperature program

Column type | Active phase | I | Reference | Comment |
---|---|---|---|---|
Capillary | CP-Wax 52CB | 1319. | Condurso, Verzera, et al., 2006 | 60. m/0.25 mm/0.25 μm, He; Program: 45C(5min) => 10C/min => 80C => 2C/min => 240C |

Normal alkane RI, non-polar column, temperature ramp

Column type | Active phase | I | Reference | Comment |
---|---|---|---|---|
Capillary | DB-1 | 960. | Xu, Tang, et al., 2010 | 30. m/0.25 mm/0.25 μm, Helium, 50. C @ 2. min, 4. K/min, 220. C @ 2. min |

Normal alkane RI, non-polar column, custom temperature program

Column type | Active phase | I | Reference | Comment |
---|---|---|---|---|
Capillary | DB-1 | 980. | Xu, Tang, et al., 2010 | 30. m/0.25 mm/0.25 μm, Helium; Program: not specified |
Capillary | HP-5 MS | 985. | Xie, Sun, et al., 2008 | 30. m/0.25 mm/0.25 μm, Helium; Program: 40 0C (2 min) 4 0C/min -> 220 0C 20 0C/min -> 280 0C |
Capillary | HP-5 MS | 986. | Xie, Sun, et al., 2008 | 30. m/0.25 mm/0.25 μm, Helium; Program: 40 0C (2 min) 4 0C/min -> 220 0C 20 0C/min -> 280 0C |

References

Frinton Laboratories Inc., 1986
Frinton Laboratories Inc.,
Catalog Number 11, Frinton Laboratories Inc., Vineland, NJ, 1986, 99. [all data]
Condurso, Verzera, et al., 2006
Condurso, C.; Verzera, A.; Romeo, V.; Ziino, M.; Trozzi, A.; Ragusa, S.,
The leaf volatile constituents of Isatis tinctoria by solid-phase microextraction and gas chromatography/mass spectrometry,
Planta Medica, 2006, 72, 10, 924-928, https://doi.org/10.1055/s-2006-946679
. [all data]
Beaulieu and Grimm, 2001
Beaulieu, J.C.; Grimm, C.C.,
Identification of volatile compounds in cantaloupe at various developmental stages using solid phase microextraction,
J. Agric. Food Chem., 2001, 49, 3, 1345-1352, https://doi.org/10.1021/jf0005768
. [all data]
Xu, Tang, et al., 2010
Xu, X.; Tang, Z.; Liang, Y.,
Comparative analysis of plant essential oils by GC-MS coupled with integrated chemometric resolution methods,
Anal. Methods, 2010, 2, 4, 359-367, https://doi.org/10.1039/b9ay00213h
. [all data]
Xie, Sun, et al., 2008
Xie, J.; Sun, B.; Zheng, F.; Wang, S.,
Volatile flavor constituents in roasted pork of mini-pig,
Food Chem., 2008, 109, 3, 506-514, https://doi.org/10.1016/j.foodchem.2007.12.074
. [all data]