Benzene, 1-fluoro-2-methoxy-
- Formula: C7H7FO
- Molecular weight: 126.1283
- IUPAC Standard InChIKey: JIXDOBAQOWOUPA-UHFFFAOYSA-N
- CAS Registry Number: 321-28-8
- Chemical structure:
View 3d structure (requires JavaScript / HTML 5) - Other names: Anisole, o-fluoro-; o-Fluoroanisole; 1-Fluoro-2-methoxybenzene; 2-Fluoroanisole

Phase change data

Data compiled as indicated in comments:
BS - Robert L. Brown and Stephen E. Stein
AC - William E. Acree, Jr., James S. Chickos
Quantity | Value | Units | Method | Reference | Comment |
---|---|---|---|---|---|
Tboil | 427. to 428. | K | N/A | PCR Inc., 1990 | BS |
Tboil | 427.7 | K | N/A | Weast and Grasselli, 1989 | BS |
Quantity | Value | Units | Method | Reference | Comment |
ΔvapH° | 52.1 ± 1.1 | kJ/mol | C | Ribeiro da Silva and Lobo Ferreira, 2009 | AC |

Reaction thermochemistry data

Data compiled by: John E. Bartmess
Individual Reactions
C7H6FO- + =
By formula: C7H6FO- + H+ = C7H7FO
Quantity | Value | Units | Method | Reference | Comment |
---|---|---|---|---|---|
ΔrH° | 1618. ± 21. | kJ/mol | G+TS | Ingemann and Nibbering, 1983 | gas phase; Between H2O, MeOH |
Quantity | Value | Units | Method | Reference | Comment |
ΔrG° | 1586. ± 21. | kJ/mol | IMRB | Ingemann and Nibbering, 1983 | gas phase; Between H2O, MeOH |

Gas phase ion energetics data

Data compiled as indicated in comments:
B - John E. Bartmess
MM - Michael M. Meot-Ner (Mautner)
Proton affinity at 298K
Proton affinity (kJ/mol) | Reference | Comment |
---|---|---|
808. | Bogdanov, van Duijn, et al., 2002 | MM |
Gas basicity at 298K
Gas basicity (review) (kJ/mol) | Reference | Comment |
---|---|---|
778. | Bogdanov, van Duijn, et al., 2002 | MM |
De-protonation reactions
C7H6FO- + =
By formula: C7H6FO- + H+ = C7H7FO
Quantity | Value | Units | Method | Reference | Comment |
---|---|---|---|---|---|
ΔrH° | 1618. ± 21. | kJ/mol | G+TS | Ingemann and Nibbering, 1983 | gas phase; Between H2O, MeOH; B |
Quantity | Value | Units | Method | Reference | Comment |
ΔrG° | 1586. ± 21. | kJ/mol | IMRB | Ingemann and Nibbering, 1983 | gas phase; Between H2O, MeOH; B |

Kovats' RI, non-polar column, isothermal

Column type | Active phase | Temperature (C) | I | Reference | Comment |
---|---|---|---|---|---|
Packed | Apiezon L | 180. | 934. | Vernon and Edwards, 1975 | N2, Celite; Column length: 1. m |

Kovats' RI, non-polar column, custom temperature program

Column type | Active phase | I | Reference | Comment |
---|---|---|---|---|
Packed | Apiezon M | 919.7 | Jalali-Heravi and Garkani-Nejad, 1993 | Chromosorb W; Column length: 2. m; Program: not specified |

References

PCR Inc., 1990
PCR Inc.,
Research Chemicals Catalog 1990-1991, PCR Inc., Gainesville, FL, 1990, 1. [all data]
Weast and Grasselli, 1989
CRC Handbook of Data on Organic Compounds, 2nd Editon, Weast,R.C and Grasselli, J.G., ed(s)., CRC Press, Inc., Boca Raton, FL, 1989, 1. [all data]
Ribeiro da Silva and Lobo Ferreira, 2009
Ribeiro da Silva, Manuel A.V.; Lobo Ferreira, Ana I.M.C.,
Experimental and computational study on the molecular energetics of the three monofluoroanisole isomers,
The Journal of Chemical Thermodynamics, 2009, 41, 3, 361-366, https://doi.org/10.1016/j.jct.2008.09.012
. [all data]
Ingemann and Nibbering, 1983
Ingemann, S.; Nibbering, N.M.M.,
Gas phase reactions of anions with 2-,3-, and 4-fluoroanisole,
J. Org. Chem., 1983, 48, 183. [all data]
Bogdanov, van Duijn, et al., 2002
Bogdanov, B.; van Duijn, D.; Ingemann, S.; Hammerum, S.,
Protonation of fluorophenols and fluoroanisoles in the gas phase: experiment and theory,
Phys. Chem. Chem. Phys., 2002, 4, 2904. [all data]
Vernon and Edwards, 1975
Vernon, F.; Edwards, G.T.,
Gas-liquid chromatography on fluorinated stationary phases. II. Fluorinated compounds containing a functional group,
J. Chromatogr., 1975, 114, 1, 87-93, https://doi.org/10.1016/S0021-9673(00)85245-0
. [all data]
Jalali-Heravi and Garkani-Nejad, 1993
Jalali-Heravi, M.; Garkani-Nejad, Z.,
Prediction of gas chromatographic retention indices of some benzene derivatives,
J. Chromatogr., 1993, 648, 2, 389-393, https://doi.org/10.1016/0021-9673(93)80421-4
. [all data]