Benzene, 1,2-dichloro-3-nitro-
- Formula: C6H3Cl2NO2
- Molecular weight: 192.000
- IUPAC Standard InChIKey: CMVQZRLQEOAYSW-UHFFFAOYSA-N
- CAS Registry Number: 3209-22-1
- Chemical structure:
View 3d structure (requires JavaScript / HTML 5) - Other names: 1,2-Dichloro-3-nitrobenzene; 2,3-Dichloro-1-nitrobenzene; 2,3-Dichloronitrobenzene

Phase change data

Data compiled as indicated in comments:
BS - Robert L. Brown and Stephen E. Stein
TRC - Thermodynamics Research Center, NIST Boulder Laboratories, Chris Muzny director
Quantity | Value | Units | Method | Reference | Comment |
---|---|---|---|---|---|
Tboil | 530.7 | K | N/A | Weast and Grasselli, 1989 | BS |
Quantity | Value | Units | Method | Reference | Comment |
Tfus | 333.52 | K | N/A | Witschonke, 1954 | Uncertainty assigned by TRC = 0.25 K; TRC |
Tfus | 334.05 | K | N/A | Witschonke, 1954 | Uncertainty assigned by TRC = 0.15 K; TRC |
Tfus | 333. | K | N/A | Buechner, 1906 | Uncertainty assigned by TRC = 2. K; TRC |

Gas phase ion energetics data

Data compiled by: John E. Bartmess
Electron affinity determinations
EA (eV) | Method | Reference | Comment |
---|---|---|---|
1.292 ± 0.048 | IMRE | Fukuda and McIver, 1985 | ΔGea(355 K) = -29.1 kcal/mol; ΔSea =-2.0, est. from data in Chowdhury, Heinis, et al., 1986 |

Normal alkane RI, non-polar column, custom temperature program

Column type | Active phase | I | Reference | Comment |
---|---|---|---|---|
Capillary | OV-1, SE-30, Methyl silicone, SP-2100, OV-101, DB-1, etc. | 1344. | Waggott and Davies, 1984 | Hydrogen; Column length: 50. m; Column diameter: 0.32 mm; Program: not specified |

Normal alkane RI, polar column, custom temperature program

Column type | Active phase | I | Reference | Comment |
---|---|---|---|---|
Capillary | Carbowax 400, Carbowax 20M, Carbowax 1540, Carbowax 4000, Superox 06, PEG 20M, etc. | 2137. | Waggott and Davies, 1984 | Hydrogen; Column length: 50. m; Column diameter: 0.32 mm; Program: not specified |
Capillary | Superox 0.6; Carbowax 20M | 2137. | Waggott and Davies, 1984 | Hydrogen; Column length: 50. m; Column diameter: 0.32 mm; Program: not specified |

Lee's RI, non-polar column, temperature ramp

Column type | Active phase | I | Reference | Comment |
---|---|---|---|---|
Capillary | HP5-MS | 241. | Vrana, Paschke, et al., 2005 | 30. m/0.25 mm/0.25 μm, Helium, 50. C @ 5. min, 5. K/min, 280. C @ 10. min |

References

Weast and Grasselli, 1989
CRC Handbook of Data on Organic Compounds, 2nd Editon, Weast,R.C and Grasselli, J.G., ed(s)., CRC Press, Inc., Boca Raton, FL, 1989, 1. [all data]
Witschonke, 1954
Witschonke, C.R.,
Freezing point and purity data for some organic compounds,
Anal. Chem., 1954, 26, 562-4. [all data]
Buechner, 1906
Buechner, E.H.,
Z. Phys. Chem., Stoechiom. Verwandtschaftsl., 1906, 54, 665. [all data]
Fukuda and McIver, 1985
Fukuda, E.K.; McIver, R.T., Jr.,
Relative electron affinities of substituted benzophenones, nitrobenzenes, and quinones. [Anchored to EA(SO2) from 74CEL/BEN],
J. Am. Chem. Soc., 1985, 107, 2291. [all data]
Chowdhury, Heinis, et al., 1986
Chowdhury, S.; Heinis, T.; Grimsrud, E.P.; Kebarle, P.,
Entropy Changes and Electron Affinities from Gas-Phase Electron Transfer Equilibria: A- + B = A + B-,
J. Phys. Chem., 1986, 90, 12, 2747, https://doi.org/10.1021/j100403a037
. [all data]