Benzenamine, 4-chloro-3-(trifluoromethyl)-
- Formula: C7H5ClF3N
- Molecular weight: 195.570
- IUPAC Standard InChIKey: ASPDJZINBYYZRU-UHFFFAOYSA-N
- CAS Registry Number: 320-51-4
- Chemical structure:
View 3d structure (requires JavaScript / HTML 5) - Other names: 5-Amino-2-chlorobenzotrifluoride; 6-Chloro-3-aminobenzotrifluoride; m-Toluidine, 4-chloro-α,α,α-trifluoro-; Aniline, 4-chloro-3-(trifluoromethyl)-; 3-(Trifluoromethyl)-4-chloroaniline; 4-Chloro-3-(trifluoromethyl)aniline; 4-chloro-α,α,α-trifluoro-m-toluidine

Phase change data

Data compiled by: Robert L. Brown and Stephen E. Stein
Reduced pressure boiling point
Tboil (K) | Pressure (bar) | Reference |
---|---|---|
358. | 0.004 | Frinton Laboratories Inc., 1986 |

References

Frinton Laboratories Inc., 1986
Frinton Laboratories Inc.,
Catalog Number 11, Frinton Laboratories Inc., Vineland, NJ, 1986, 99. [all data]