β-Hexachlorocyclohexane
- Formula: C6H6Cl6
- Molecular weight: 290.830
- IUPAC Standard InChIKey: JLYXXMFPNIAWKQ-UHFFFAOYSA-N
- CAS Registry Number: 319-85-7
- Chemical structure:
View 3d structure (requires JavaScript / HTML 5) - Species with the same structure:
- Stereoisomers:
- Other names: Cyclohexane, 1,2,3,4,5,6-hexachloro-, (1α,2β,3α,4β,5α,6β)-; Cyclohexane, 1,2,3,4,5,6-hexachloro-, β-; β-Benzene hexachloride; β-HCH; β-Lindane; β-1,2,3,4,5,6-Hexachlorocyclohexane; Cyclohexane, 1,2,3,4,5,6-hexachloro-, β-isomer; trans-α-Benzenehexachloride; Cyclohexane, β-1,2,3,4,5,6-hexachloro-; Cyclohexane, 1,2,3,4,5,6-hexachloro-, trans-; ENT 9,233; 1-α,2-β,3-α,4-β,5-α,6-β-Hexachlorocyclohexane; BHC-β isomer; BHC β; β-BHC; HCH-β; 1,2,3,4,5,6-Hexachlorocyclohexane, (1α,2β,3α,4β,5α,6β)-; (1α,2β,3α,4β,5α,6β)-1,2,3,4,5,6-hexachlorocyclohexane

Condensed phase thermochemistry data

Data compiled by: Hussein Y. Afeefy, Joel F. Liebman, and Stephen E. Stein
Quantity | Value | Units | Method | Reference | Comment |
---|---|---|---|---|---|
ΔfH°solid | -400.7 ± 2.7 | kJ/mol | Ccb | An and Guo, 1995 | Author was aware that data differs from previously reported values; HCl(1:600 H2O) |
ΔfH°solid | -179.9 | kJ/mol | Ccb | Schwabe, 1956 | |
Quantity | Value | Units | Method | Reference | Comment |
ΔcH°solid | -2959.7 ± 2.5 | kJ/mol | Ccb | An and Guo, 1995 | Author was aware that data differs from previously reported values; HCl(1:600 H2O) |
ΔcH°solid | -2735.1 ± 0.8 | kJ/mol | Ccb | Schwabe, 1956 |

Phase change data

Data compiled as indicated in comments:
TRC - Thermodynamics Research Center, NIST Boulder Laboratories, Chris Muzny director
AC - William E. Acree, Jr., James S. Chickos
Quantity | Value | Units | Method | Reference | Comment |
---|---|---|---|---|---|
Tfus | 570. | K | N/A | Van de Vloed, 1939 | Uncertainty assigned by TRC = 2. K; TRC |
Enthalpy of sublimation
ΔsubH (kJ/mol) | Temperature (K) | Method | Reference | Comment |
---|---|---|---|---|
103.7 | 506. to 551. | N/A | Lubkowski, Janiak, et al., 1989 | AC |
107. | 328. | A | Stephenson and Malanowski, 1987 | Based on data from 313. to 363. K. See also Jones, 1960.; AC |
102.9 | 379. | TE | Balson, 1947 | Based on data from 368. to 390. K.; AC |

Kovats' RI, non-polar column, isothermal

Column type | Active phase | Temperature (C) | I | Reference | Comment |
---|---|---|---|---|---|
Packed | OV-1 | 200. | 1694. | Dubsky, Hána, et al., 1979 | Column length: 2. m |

Kovats' RI, non-polar column, custom temperature program

Column type | Active phase | I | Reference | Comment |
---|---|---|---|---|
Packed | SE-30 | 1710. | Ramsey, Lee, et al., 1980 | He, Chromosorb G HP (80-100 mesh); Column length: 1.5 m; Program: not specified |

Normal alkane RI, non-polar column, custom temperature program

Column type | Active phase | I | Reference | Comment |
---|---|---|---|---|
Capillary | 5 % Phenyl methyl siloxane | 1761. | Department of Food Safety and Welfare, 2006 | 30. m/0.25 mm/0.25 μm, Helium; Program: 50 0C(1 min) 25 0C/min -> 125 0C 10 0C/min -> 300 0C (10 min) |
Capillary | OV-1, SE-30, Methyl silicone, SP-2100, OV-101, DB-1, etc. | 1749. | Waggott and Davies, 1984 | Hydrogen; Column length: 50. m; Column diameter: 0.32 mm; Program: not specified |
Other | Methyl Silicone | 1710. | Ardrey and Moffat, 1981 | Program: not specified |

Normal alkane RI, polar column, custom temperature program

Column type | Active phase | I | Reference | Comment |
---|---|---|---|---|
Capillary | Superox 0.6; Carbowax 20M | 2856. | Waggott and Davies, 1984 | Hydrogen; Column length: 50. m; Column diameter: 0.32 mm; Program: not specified |
Capillary | Carbowax 400, Carbowax 20M, Carbowax 1540, Carbowax 4000, Superox 06, PEG 20M, etc. | 2856. | Waggott and Davies, 1984 | Hydrogen; Column length: 50. m; Column diameter: 0.32 mm; Program: not specified |

References

An and Guo, 1995
An, X.-W.; Guo, D.-J.,
Formation enthalpies and non-bonding interactions of hexachlorocyclohexanes,
Thermochim. Acta, 1995, 253, 235-242. [all data]
Schwabe, 1956
Schwabe, K.,
Thermochemische Untersuchungen an den isomeren Hexachlorcyclohexanen,
Z. Electrochem., 1956, 60, 151-157. [all data]
Van de Vloed, 1939
Van de Vloed, A.,
Bull. Soc. Chim. Belg., 1939, 48, 229. [all data]
Lubkowski, Janiak, et al., 1989
Lubkowski, Jacek; Janiak, Tadeusz; Czerminski, Jurand; Bla·ejowski, Jerzy,
Thermoanalytical investigations of some chloro-organic pesticides and related compounds,
Thermochimica Acta, 1989, 155, 7-28, https://doi.org/10.1016/0040-6031(89)87132-1
. [all data]
Stephenson and Malanowski, 1987
Stephenson, Richard M.; Malanowski, Stanislaw,
Handbook of the Thermodynamics of Organic Compounds, 1987, https://doi.org/10.1007/978-94-009-3173-2
. [all data]
Jones, 1960
Jones, A.H.,
Sublimation Pressure Data for Organic Compounds.,
J. Chem. Eng. Data, 1960, 5, 2, 196-200, https://doi.org/10.1021/je60006a019
. [all data]
Balson, 1947
Balson, E.W.,
Studies in vapour pressure measurement, Part III.?An effusion manometer sensitive to 5 «65533» 10?6 millimetres of mercury: vapour pressure of D.D.T. and other slightly volatile substances,
Trans. Faraday Soc., 1947, 43, 54, https://doi.org/10.1039/tf9474300054
. [all data]
Dubsky, Hána, et al., 1979
Dubsky, H.; Hána, K.; Komárková, M.; Rittich, B.,
Stanoveni residui chlórovanych pesticidu plynovou chromatografii,
Vet. Med. (Prague), 1979, 24, 3, 493-498. [all data]
Ramsey, Lee, et al., 1980
Ramsey, J.D.; Lee, T.D.; Osselton, M.D.; Moffat, A.C.,
Gas-liquid chromatographic retention indices of 296 non-drug substances on SE-30 or OV-1 likely to be encountered in toxicological analyses,
J. Chromatogr., 1980, 184, 2, 185-206, https://doi.org/10.1016/S0021-9673(00)85641-1
. [all data]
Department of Food Safety and Welfare, 2006
Department of Food Safety, Ministry of Health; Welfare,
Analytical methods for residual compositional substances of agricultural chemicals, feed aadditives, and veterinary drugs in foods, 2006, retrieved from http://www.mhlw.go.jp/english/topics/foodsafety/positivelist060228/de/060526-1a.pdf. [all data]
Waggott and Davies, 1984
Waggott, A.; Davies, I.W.,
Identification of organic pollutants using linear temperature programmed retention indices (LTPRIs) - Part II, 1984, retrieved from http://dwi.defra.gov.uk/research/completed-research/reports/dwi0383.pdf. [all data]
Ardrey and Moffat, 1981
Ardrey, R.E.; Moffat, A.C.,
Gas-liquid chromatographic retention indices of 1318 substances of toxicological interest on SE-30 or OV-1 stationary phase,
J. Chromatogr., 1981, 220, 3, 195-252, https://doi.org/10.1016/S0021-9673(00)81925-1
. [all data]