Liral
- Formula: C13H22O2
- Molecular weight: 210.3126
- IUPAC Standard InChIKey: ORMHZBNNECIKOH-UHFFFAOYSA-N
- CAS Registry Number: 31906-04-4
- Chemical structure:
View 3d structure (requires JavaScript / HTML 5) - Other names: 3-Cyclohexene-1-carboxaldehyde, 4-(4-hydroxy-4-methylpentyl)-; 4-(4-hydroxy-4-methylpentyl)cyclohex-3-enecarbaldehyde; Lyral

Normal alkane RI, non-polar column, temperature ramp

Column type | Active phase | I | Reference | Comment |
---|---|---|---|---|
Capillary | Optima-5 | 1661. | Al-Qudah, Muhaidat, et al., 2012 | 30. m/0.25 mm/0.25 μm, Helium, 60. C @ 1. min, 3. K/min; Tend: 246. C |
Capillary | BPX-5 | 1687. | Bieri and Marriott, 2008 | 30. m/0.25 mm/0.25 μm, Hydrogen, 3. K/min; Tstart: 100. C; Tend: 999. C |
Capillary | BPX-5 | 1686. | Bieri and Marriott, 2008 | 30. m/0.25 mm/0.25 μm, Hydrogen, 3. K/min; Tstart: 60. C; Tend: 999. C |
Capillary | BPX-5 | 1686. | Bieri and Marriott, 2008 | 30. m/0.25 mm/0.25 μm, Hydrogen, 3. K/min; Tstart: 60. C; Tend: 999. C |
Capillary | BPX-5 | 1688. | Bieri and Marriott, 2008 | 30. m/0.25 mm/0.25 μm, Hydrogen, 3. K/min; Tstart: 60. C; Tend: 999. C |
Capillary | BPX-5 | 1690. | Bieri and Marriott, 2008 | 30. m/0.25 mm/0.25 μm, Hydrogen, 3. K/min; Tstart: 60. C; Tend: 999. C |
Capillary | BPX-5 | 1692. | Bieri and Marriott, 2008 | 30. m/0.25 mm/0.25 μm, Hydrogen, 5. K/min; Tstart: 60. C; Tend: 999. C |
Capillary | Equity-5 MS | 1671. | Mondello, Casilli, et al., 2008 | 30. m/0.25 mm/0.25 μm, Helium, 1.5 K/min; Tstart: 40. C; Tend: 260. C |

References

Al-Qudah, Muhaidat, et al., 2012
Al-Qudah, M.A.; Muhaidat, R.; Trawenh, I.N.; Jaber, H.I.; Abu Zarga, M.H.; Abu Orabi, S.T.,
Volatile constituents of leaves and bulbs of Gynandriris Sisyrinchicum and their antimicrobial activities,
Jordan J. Chem., 2012, 7, 3, 287-295. [all data]
Bieri and Marriott, 2008
Bieri, S.; Marriott, P.J.,
Dual-injection system with multiply injections for determining sidimentional retention indexes in comprehensive two-dimensional gas chromatography,
Anal. Chem., 2008, 80, 3, 760-768, https://doi.org/10.1021/ac071367q
. [all data]
Mondello, Casilli, et al., 2008
Mondello, L.; Casilli, A.; Tranchida, Q.; Sciarrone, D.; Dugo, P.; Dugo, G.,
Analysis of allergens in fragrances using multiple heart-cut multidimentional gas chromatography - mass spectrometry,
LC-GC Europe, 2008, 21, 130. [all data]