o-Chlorobenzylidene-2-methylphenylacetonitrile
- Formula: C16H12ClN
- Molecular weight: 253.726
- IUPAC Standard InChIKey: SHNBVWVKWLZEON-GXDHUFHOSA-N
- CAS Registry Number: 31881-09-1
- Chemical structure:
View 3d structure (requires JavaScript / HTML 5) - Permanent link for this species. Use this link for bookmarking this species for future reference.

Condensed phase thermochemistry data

Data compiled by: Hussein Y. Afeefy, Joel F. Liebman, and Stephen E. Stein
Quantity | Value | Units | Method | Reference | Comment |
---|---|---|---|---|---|
ΔfH°solid | 212. | kJ/mol | Ccb | Zavoianu, Contineanu, et al., 1987 | |
ΔfH°solid | Ccb | Ciocazanu, Dogaru, et al., 1977 | uncertain value: 307.6 kJ/mol; Data origin uncertain | ||
Quantity | Value | Units | Method | Reference | Comment |
ΔcH°solid | -8229. | kJ/mol | Ccb | Zavoianu, Contineanu, et al., 1987 | |
ΔcH°solid | -8222.73 | kJ/mol | Ccb | Ciocazanu, Dogaru, et al., 1977 | Data origin uncertain |

References

Zavoianu, Contineanu, et al., 1987
Zavoianu, D.; Contineanu, I.; Moga-Gheorghe, S.; Marchidan, D.I.,
Structure and reactivity of nitriles. II. Condensing reactions of methyl and dimethylphenylacetonitriles with substituted aromatic aldehydes,
Rev. Chim. (Bucharest), 1987, 38, 9-15. [all data]
Ciocazanu, Dogaru, et al., 1977
Ciocazanu, I.; Dogaru, V.; Zavoianu, D.,
La structure et la reactivite des nitriles. Sur la chaleur de combustion de quelques nitriles alpha, beta non satures,
Rev. Roum. Chim., 1977, 22, 9-10. [all data]