Benzene, 1-methyl-4-(methylsulfonyl)-
- Formula: C8H10O2S
- Molecular weight: 170.229
- IUPAC Standard InChIKey: YYDNBUBMBZRNQQ-UHFFFAOYSA-N
- CAS Registry Number: 3185-99-7
- Chemical structure:
View 3d structure (requires JavaScript / HTML 5) - Other names: Sulfone, methyl p-tolyl; p-Tolyl methyl sulfone; Methyl p-tolyl sulfone; 1-Methyl-4-(methyl-sulphonyl)benzene; Methyl p-tolyl sulphone; Methyl 4-tolyl sulfone; 1-Methansulfonyl-4-methylbenzene; (p-Tolylsulfonyl)methane; NSC 2722; NSC 29038; p-(methylsulphonyl)toluene

Gas phase thermochemistry data

Data compiled by: Hussein Y. Afeefy, Joel F. Liebman, and Stephen E. Stein
Quantity | Value | Units | Method | Reference | Comment |
---|---|---|---|---|---|
ΔfH°gas | -273.1 ± 3.4 | kJ/mol | Ccr | Mackle and O'Hare, 1961 | Reanalyzed by Cox and Pilcher, 1970, Original value = -300. ± 3. kJ/mol; Haet of combustion corrected for pressure |

Condensed phase thermochemistry data

Data compiled by: Hussein Y. Afeefy, Joel F. Liebman, and Stephen E. Stein
Quantity | Value | Units | Method | Reference | Comment |
---|---|---|---|---|---|
ΔfH°liquid | -373.1 ± 0.79 | kJ/mol | Ccr | Mackle and O'Hare, 1961 | Reanalyzed by Cox and Pilcher, 1970, Original value = -387. ± 0.8 kJ/mol; Haet of combustion corrected for pressure |
Quantity | Value | Units | Method | Reference | Comment |
ΔcH°liquid | -4806.45 ± 0.54 | kJ/mol | Ccr | Mackle and O'Hare, 1961 | Reanalyzed by Cox and Pilcher, 1970, Original value = -4792.6 ± 0.3 kJ/mol; Haet of combustion corrected for pressure |

Phase change data

Data compiled by: Hussein Y. Afeefy, Joel F. Liebman, and Stephen E. Stein
Quantity | Value | Units | Method | Reference | Comment |
---|---|---|---|---|---|
ΔvapH° | 90. ± 2. | kJ/mol | V | Mackle and O'Hare, 1961 | Haet of combustion corrected for pressure |

Reaction thermochemistry data

Data compiled as indicated in comments:
B - John E. Bartmess
RCD - Robert C. Dunbar
Individual Reactions
C8H9O2S- + =
By formula: C8H9O2S- + H+ = C8H10O2S
Quantity | Value | Units | Method | Reference | Comment |
---|---|---|---|---|---|
ΔrH° | 1501. ± 8.8 | kJ/mol | G+TS | Taft and Topsom, 1987 | gas phase; value altered from reference due to change in acidity scale; B |
Quantity | Value | Units | Method | Reference | Comment |
ΔrG° | 1473. ± 8.4 | kJ/mol | IMRE | Taft and Topsom, 1987 | gas phase; value altered from reference due to change in acidity scale; B |
By formula: Li+ + C8H10O2S = (Li+ • C8H10O2S)
Quantity | Value | Units | Method | Reference | Comment |
---|---|---|---|---|---|
ΔrH° | 216. | kJ/mol | CIDC | Buncel, Decouzon, et al., 1997 | RCD |

Gas phase ion energetics data

Data compiled by: John E. Bartmess
De-protonation reactions
C8H9O2S- + =
By formula: C8H9O2S- + H+ = C8H10O2S
Quantity | Value | Units | Method | Reference | Comment |
---|---|---|---|---|---|
ΔrH° | 1501. ± 8.8 | kJ/mol | G+TS | Taft and Topsom, 1987 | gas phase; value altered from reference due to change in acidity scale |
Quantity | Value | Units | Method | Reference | Comment |
ΔrG° | 1473. ± 8.4 | kJ/mol | IMRE | Taft and Topsom, 1987 | gas phase; value altered from reference due to change in acidity scale |

Ion clustering data

Data compiled by: Robert C. Dunbar
Clustering reactions
By formula: Li+ + C8H10O2S = (Li+ • C8H10O2S)
Quantity | Value | Units | Method | Reference | Comment |
---|---|---|---|---|---|
ΔrH° | 216. | kJ/mol | CIDC | Buncel, Decouzon, et al., 1997 |

References

Mackle and O'Hare, 1961
Mackle, H.; O'Hare, P.A.G.,
Studies in the thermochemistry of sulphones. Part 6 - Heats of combustion, fusion, vaporization and atomization of six aromatic and two allylic sulphones,
Trans. Faraday Soc., 1961, 57, 1521-1526. [all data]
Cox and Pilcher, 1970
Cox, J.D.; Pilcher, G.,
Thermochemistry of Organic and Organometallic Compounds, Academic Press, New York, 1970, 1-636. [all data]
Taft and Topsom, 1987
Taft, R.W.; Topsom, R.D.,
The Nature and Analysis of Substituent Effects,
Prog. Phys. Org. Chem., 1987, 16, 1. [all data]
Buncel, Decouzon, et al., 1997
Buncel, E.; Decouzon, M.; Formento, A.; Gal, J.-F.; Herreros, M.; Li, L.; Maria, P.-C.,
Lithium-Cation and Proton Affinities of Sulfoxides and Sulfones: A Fourier Transform Ion Cyclotron Resonance Study,
J. Am. Soc. Mass Spectrom., 1997, 8, 3, 262, https://doi.org/10.1016/S1044-0305(96)00255-3
. [all data]