C14H12O2S
- Formula: C14H12O2S
- Molecular weight: 244.309
- CAS Registry Number: 31859-90-2

Reaction thermochemistry data

Data compiled by: John E. Bartmess
Individual Reactions
C14H11O2S- + = C14H12O2S
By formula: C14H11O2S- + H+ = C14H12O2S
Quantity | Value | Units | Method | Reference | Comment |
---|---|---|---|---|---|
ΔrH° | 1384. ± 8.8 | kJ/mol | G+TS | Taft, 1987 | gas phase; value altered from reference due to change in acidity scale |
Quantity | Value | Units | Method | Reference | Comment |
ΔrG° | 1351. ± 8.4 | kJ/mol | IMRE | Taft, 1987 | gas phase; value altered from reference due to change in acidity scale |

Gas phase ion energetics data

Data compiled by: John E. Bartmess

De-protonation reactions

C14H11O2S- + Hydrogen cation = C14H12O2S

By formula: C14H11O2S- + H+ = C14H12O2S

Quantity Value Units Method Reference Comment
Δr1384. ± 8.8kJ/molG+TSTaft, 1987gas phase; value altered from reference due to change in acidity scale
Quantity Value Units Method Reference Comment
Δr1351. ± 8.4kJ/molIMRETaft, 1987gas phase; value altered from reference due to change in acidity scale

References

Taft, 1987
Taft, R.W.,
The Nature and Analysis of Substitutent Electronic Effects,
Personal communication. See also Prog. Phys. Org. Chem., 1987, 16, 1. [all data]