cis 1-bromo-1-butene
- Formula: C4H7Br
- Molecular weight: 135.002
- IUPAC Standard InChIKey: IUXHPSPHPKXTPA-ARJAWSKDSA-N
- CAS Registry Number: 31849-78-2
- Chemical structure:
View 3d structure (requires JavaScript / HTML 5) - Stereoisomers:

Phase change data

Data compiled as indicated in comments:
TRC - Thermodynamics Research Center, NIST Boulder Laboratories, Chris Muzny director
AC - William E. Acree, Jr., James S. Chickos
Quantity | Value | Units | Method | Reference | Comment |
---|---|---|---|---|---|
Tboil | 359.30 | K | N/A | Timmermans, 1927 | Uncertainty assigned by TRC = 0.4 K; source of data not clear; TRC |
Tboil | 366. | K | N/A | Kirrmann, 1926 | Uncertainty assigned by TRC = 8. K; cis or trans not identified; TRC |
Enthalpy of vaporization
ΔvapH (kJ/mol) | Temperature (K) | Method | Reference | Comment |
---|---|---|---|---|
35.1 | 295. | A | Stephenson and Malanowski, 1987 | Based on data from 280. to 397. K. See also Dykyj, 1971.; AC |
36.5 | 244. | N/A | Stull, 1947 | Based on data from 229. to 359. K.; AC |

Reaction thermochemistry data

Data compiled by: Hussein Y. Afeefy, Joel F. Liebman, and Stephen E. Stein
Individual Reactions
By formula: C4H7Br = C4H7Br
Quantity | Value | Units | Method | Reference | Comment |
---|---|---|---|---|---|
ΔrH° | -1.46 | kJ/mol | Eqk | Sharonov, Rozhnov, et al., 1975 | gas phase |

References

Timmermans, 1927
Timmermans, J.,
The Melting Point of Organic Substances,
Bull. Soc. Chim. Belg., 1927, 36, 502. [all data]
Kirrmann, 1926
Kirrmann, A.,
The Reaction of Magnesium with Propylene Dibromide,
C. R. Hebd. Seances Acad. Sci., 1926, 182, 1629-31. [all data]
Stephenson and Malanowski, 1987
Stephenson, Richard M.; Malanowski, Stanislaw,
Handbook of the Thermodynamics of Organic Compounds, 1987, https://doi.org/10.1007/978-94-009-3173-2
. [all data]
Dykyj, 1971
Dykyj, J.,
Petrochemia, 1971, 11, 2, 27. [all data]
Stull, 1947
Stull, Daniel R.,
Vapor Pressure of Pure Substances. Organic and Inorganic Compounds,
Ind. Eng. Chem., 1947, 39, 4, 517-540, https://doi.org/10.1021/ie50448a022
. [all data]
Sharonov, Rozhnov, et al., 1975
Sharonov, K.G.; Rozhnov, A.M.; Brezhneva, V.G.; Shishinova, V.I.,
Equilibrium of isomerization of geometric forms of 1-bromo-1-butene and 2-bromo-2-butene,
Izv. Vyssh. Uchebn. Zaved., Khim. Khim. Tekhnol., 1975, 18, 786-788. [all data]