1-Butanamine, N-nitro-
- Formula: C4H10N2O2
- Molecular weight: 118.1344
- IUPAC Standard InChIKey: FCLOSAGZCUDMFV-UHFFFAOYSA-N
- CAS Registry Number: 3182-75-0
- Chemical structure:
View 3d structure (requires JavaScript / HTML 5) - Other names: n-Butylnitramine

Condensed phase thermochemistry data

Data compiled by: Hussein Y. Afeefy, Joel F. Liebman, and Stephen E. Stein
Quantity | Value | Units | Method | Reference | Comment |
---|---|---|---|---|---|
ΔcH°liquid | -2887. | kJ/mol | Ccb | Handrick, 1956 | Naval Powder Factory Report 88, 1954 |

References

Handrick, 1956
Handrick, G.R.,
Report of the study of pure explosive compounds. Part IV. Calculation of heat of combustion of organic compounds from structural features and calculation of power of high explosives, Rpt. C-58247 for the Office of the Chief of Ordnance, contract DA-19-020-ORD-47 by the Arthur D. Little, Inc., Cambridge, MA, 1956, 467-573. [all data]