1,1,1,3,3,3-hexachloro-2,2-difluoropropane
- Formula: C3Cl6F2
- Molecular weight: 286.747
- IUPAC Standard InChIKey: YXVCODVAPNKSMC-UHFFFAOYSA-N
- CAS Registry Number: 3182-26-1
- Chemical structure:
View 3d structure (requires JavaScript / HTML 5) - Permanent link for this species. Use this link for bookmarking this species for future reference.

Phase change data

Data compiled by: Thermodynamics Research Center, NIST Boulder Laboratories, Chris Muzny director
Quantity | Value | Units | Method | Reference | Comment |
---|---|---|---|---|---|
Tboil | 469.90 | K | N/A | Coffman, Cramer, et al., 1949 | Uncertainty assigned by TRC = 3. K |
Quantity | Value | Units | Method | Reference | Comment |
Tfus | 260.3 | K | N/A | Henne, Renoll, et al., 1939 | Uncertainty assigned by TRC = 1. K |

References

Coffman, Cramer, et al., 1949
Coffman, D.D.; Cramer, R.; Rigby, G.W.,
Synthesis of Chlorofluoropropanes,
J. Am. Chem. Soc., 1949, 71, 979-80. [all data]
Henne, Renoll, et al., 1939
Henne, A.L.; Renoll, M.W.; Leicester, H.M.,
J. Am. Chem. Soc., 1939, 61, 938. [all data]